program: Orca
programVersion: 5.0.2
elementType: Cl Cl O O O N N C C C C C C C C C C C C C C C C C C C C C C H H H H H H H H H H H H H H H H H H H H
charge: 0
multiplicity: 1
keywords: wb97x-d3
keywords: def2-TZVPP
keywords: def2/J RIJCOSX
keywords: DEFGRID2
keywords: scfconv7
keywords: smallprint printgap noloewdin
keywords: NOSOSCF
formula: C22H20Cl2N2O3
InChI: InChI=1/C22H20Cl2N2O3/c1-12-5-7-15(8-6-12)18(27)11-29-22-19(14(3)25-26(22)4)21(28)16-9-10-17(23)13(2)20(16)24/h5-10H,11H2,1-4H3
49 atoms
Cl 0.827163 3.42066 0.141336
Cl -4.339229 2.055078 0.921663
O  1.42795 0.309925 1.117483
O  0.797701 1.245114 -3.210099
O  1.98698 -2.354279 1.13847
N  3.549344 0.314823 0.236351
N  4.238686 0.543836 -0.893612
C  2.030638 0.798038 -1.274744
C  2.235888 0.449478 0.060567
C  3.349712 0.816018 -1.814504
C  0.833532 1.181083 -1.999477
C  -0.429806 1.479092 -1.24008
C  3.776486 1.129468 -3.203365
C  0.369478 -0.612086 1.046958
C  4.243643 -0.011061 1.457496
C  -0.53692 2.427956 -0.23175
C  -1.723221 2.655087 0.476197
C  -1.573576 0.776659 -1.606018
C  0.820268 -2.062228 1.054478
C  -0.2436 -3.091666 0.943816
C  -2.821982 1.88049 0.106937
C  -2.760989 0.958714 -0.928649
C  -1.776295 3.693307 1.553163
C  0.124977 -4.436086 0.929002
C  -1.596696 -2.769909 0.844953
C  -2.186504 -5.109281 0.720367
C  -0.832379 -5.425121 0.816672
C  -2.550661 -3.766434 0.736118
C  -3.223629 -6.187022 0.627414
H  4.863275 1.12257 -3.259329
H  3.383623 0.404102 -3.914263
H  3.416003 2.107234 -3.521454
H  -0.25845 -0.418638 1.92007
H  -0.257116 -0.442023 0.169217
H  4.086857 0.757241 2.21331
H  3.910202 -0.969826 1.844118
H  5.300619 -0.061666 1.217619
H  -1.519429 0.066005 -2.420033
H  -3.642841 0.398493 -1.205881
H  -1.579406 4.684186 1.142689
H  -2.743218 3.721825 2.044899
H  -1.01673 3.506207 2.312276
H  1.171687 -4.699939 0.998142
H  -1.930178 -1.739683 0.844601
H  -0.524499 -6.463496 0.798887
H  -3.59597 -3.494007 0.657408
H  -2.836137 -7.075526 0.130575
H  -3.556063 -6.49039 1.622251
H  -4.103765 -5.853006 0.079345
totalener: -2106.06520004 hartree
nucrepener: 3129.58297540 hartree
electener: -5235.64817544 hartree
oneelecener: -9109.57639851 hartree
twoeener: 3873.92822307 hartree
kineticenergy: 2099.78203998 hartree
xcener: -157.008283945544 hartree
chargesum: -0.0000000
charge: -0.049048 -0.066744 -0.323392 -0.340843 -0.355557 0.143515 -0.293608 -0.211594 0.224308 0.075797 0.323622 0.047246 -0.240523 0.068112 -0.180314 -0.042792 -0.049485 -0.084875 0.306535 -0.037067 0.148084 -0.235682 -0.226803 -0.106991 -0.143280 0.024663 -0.132588 -0.157332 -0.202035 0.095449 0.096693 0.093396 0.129154 0.041387 0.106167 0.122998 0.112885 0.129308 0.125292 0.108169 0.085837 0.102440 0.138520 0.117090 0.117245 0.113873 0.089811 0.104108 0.088847
qa: -0.0490 -0.0667 -0.3234 -0.3408 -0.3556 0.1435 -0.2936 -0.2116 0.2243 0.0758 0.3236 0.0472 -0.2405 0.0681 -0.1803 -0.0428 -0.0495 -0.0849 0.3065 -0.0371 0.1481 -0.2357 -0.2268 -0.1070 -0.1433 0.0247 -0.1326 -0.1573 -0.2020 0.0954 0.0967 0.0934 0.1292 0.0414 0.1062 0.1230 0.1129 0.1293 0.1253 0.1082 0.0858 0.1024 0.1385 0.1171 0.1172 0.1139 0.0898 0.1041 0.0888
va: 1.2944 1.2591 2.0825 2.1516 2.1188 3.3188 2.9283 3.4743 4.0555 4.0336 3.9516 3.4845 3.9505 3.8769 3.8892 3.9334 3.7344 3.9047 3.9029 3.6871 3.7958 4.0010 3.9399 4.0212 4.0016 3.7911 3.9634 4.0478 3.9098 1.0152 1.0024 1.0016 0.9945 1.0418 0.9894 1.0029 1.0137 1.0187 1.0157 1.0005 1.0247 1.0014 1.0251 1.0058 1.0080 1.0100 1.0047 0.9934 1.0042
dispcorr: -0.028955643 hartree
energy: -2106.094155678472
dipole: 3.59504 -5.24986 -1.65482 -26.60551 25.39926 -1.20625 1.78525 -0.36691 1.41834
magnitude: 2.49101 au
magnitude: 6.33165 debye
