program: Orca
programVersion: 5.0.2
elementType: Cl Cl O O O N N C C C C C C C C C C C C C C C C C C C C C C H H H H H H H H H H H H H H H H H H H H
charge: 0
multiplicity: 1
keywords: wb97x-d3
keywords: def2-TZVPP
keywords: def2/J RIJCOSX
keywords: DEFGRID2
keywords: scfconv7
keywords: smallprint printgap noloewdin
keywords: NOSOSCF
formula: C22H20Cl2N2O3
InChI: InChI=1/C22H20Cl2N2O3/c1-12-5-7-15(8-6-12)18(27)11-29-22-19(14(3)25-26(22)4)21(28)16-9-10-17(23)13(2)20(16)24/h5-10H,11H2,1-4H3
49 atoms
Cl -0.915284 1.66649 -3.191743
Cl -3.77314 3.827906 0.854958
O  3.365371 -1.432582 -0.084029
O  0.472343 -0.661761 -1.607087
O  1.544765 -1.335178 1.867922
N  4.160636 0.665702 0.157761
N  3.853761 1.971411 0.037668
C  2.074449 0.699903 -0.527847
C  3.142831 -0.128545 -0.178683
C  2.607774 2.013095 -0.352598
C  0.745155 0.346854 -0.988509
C  -0.356841 1.28258 -0.591097
C  1.958725 3.327243 -0.62183
C  2.31112 -2.360963 -0.122927
C  5.448435 0.256553 0.654513
C  -1.220569 1.871762 -1.502633
C  -2.295887 2.677525 -1.118264
C  -0.571685 1.498722 0.76375
C  1.306434 -2.138027 0.99785
C  0.064583 -2.944904 0.987757
C  -2.47385 2.852717 0.253966
C  -1.630794 2.273754 1.190248
C  -3.183732 3.300953 -2.150466
C  -0.288455 -3.777576 -0.072808
C  -0.79371 -2.858812 2.082469
C  -2.328669 -4.414199 1.053196
C  -1.466043 -4.501328 -0.036197
C  -1.968987 -3.584793 2.112758
C  -3.624286 -5.167734 1.063717
H  1.489751 3.350326 -1.60571
H  1.186789 3.560703 0.111533
H  2.710374 4.113411 -0.583483
H  1.823437 -2.35368 -1.097347
H  2.777873 -3.339512 0.017182
H  5.977016 -0.358694 -0.072169
H  6.022021 1.158764 0.840075
H  5.34923 -0.302298 1.584257
H  0.096362 1.047286 1.486265
H  -1.803366 2.434184 2.244925
H  -2.618091 3.976992 -2.792365
H  -3.620659 2.538801 -2.795723
H  -3.994722 3.865866 -1.702277
H  0.339051 -3.860714 -0.949727
H  -0.531367 -2.217188 2.912727
H  -1.724935 -5.136909 -0.874174
H  -2.62263 -3.50382 2.972567
H  -4.035344 -5.249909 2.068779
H  -4.368885 -4.661584 0.446296
H  -3.506479 -6.17561 0.665991
totalener: -2106.06701723 hartree
nucrepener: 3108.04148501 hartree
electener: -5214.10850225 hartree
oneelecener: -9067.53485236 hartree
twoeener: 3853.42635011 hartree
kineticenergy: 2099.78228682 hartree
xcener: -157.010489820253 hartree
chargesum: -0.0000000
charge: -0.055621 -0.073627 -0.303303 -0.354612 -0.347198 0.093947 -0.289420 -0.163820 0.315935 0.089420 0.218438 0.053269 -0.279869 -0.052452 -0.178388 0.020503 -0.045625 -0.180270 0.302222 -0.040803 0.112358 -0.145912 -0.229830 -0.119115 -0.119006 0.020026 -0.148273 -0.126186 -0.205554 0.094295 0.100497 0.109260 0.143183 0.133439 0.106793 0.114866 0.113846 0.149663 0.120568 0.102339 0.104458 0.084941 0.112852 0.132443 0.114243 0.113323 0.084214 0.105783 0.091764
qa: -0.0556 -0.0736 -0.3033 -0.3546 -0.3472 0.0939 -0.2894 -0.1638 0.3159 0.0894 0.2184 0.0533 -0.2799 -0.0525 -0.1784 0.0205 -0.0456 -0.1803 0.3022 -0.0408 0.1124 -0.1459 -0.2298 -0.1191 -0.1190 0.0200 -0.1483 -0.1262 -0.2056 0.0943 0.1005 0.1093 0.1432 0.1334 0.1068 0.1149 0.1138 0.1497 0.1206 0.1023 0.1045 0.0849 0.1129 0.1324 0.1142 0.1133 0.0842 0.1058 0.0918
va: 1.2864 1.2509 2.1478 2.1006 2.1142 3.3076 2.9371 3.3794 4.0510 3.9350 3.9480 3.4614 3.9787 3.8861 3.9053 3.9330 3.7428 3.9502 3.7923 3.6461 3.8487 4.0733 3.9356 4.0076 4.0180 3.7982 4.0168 3.9624 3.9114 0.9984 0.9893 1.0201 1.0206 0.9899 0.9903 1.0129 0.9932 1.0040 1.0153 1.0014 1.0003 1.0259 1.0182 1.0287 1.0085 1.0087 1.0073 0.9929 1.0013
dispcorr: -0.028454929 hartree
energy: -2106.095472162810
dipole: 5.40721 -5.68254 -0.27533 -19.77699 18.40156 -1.37543 7.32085 -7.04795 0.27291
magnitude: 1.42901 au
magnitude: 3.63226 debye
