program: Orca
programVersion: 5.0.2
elementType: Cl Cl O O O N N C C C C C C C C C C C C C C C C C C C C C C H H H H H H H H H H H H H H H H H H H H
charge: 0
multiplicity: 1
keywords: wb97x-d3
keywords: def2-TZVPP
keywords: def2/J RIJCOSX
keywords: DEFGRID2
keywords: scfconv7
keywords: smallprint printgap noloewdin
keywords: NOSOSCF
formula: C22H20Cl2N2O3
InChI: InChI=1/C22H20Cl2N2O3/c1-12-5-7-15(8-6-12)18(27)11-29-22-19(14(3)25-26(22)4)21(28)16-9-10-17(23)13(2)20(16)24/h5-10H,11H2,1-4H3
49 atoms
Cl 0.777989 2.626486 -2.480722
Cl -4.293826 0.803735 -2.079299
O  1.54382 -0.379345 -1.225644
O  0.818804 3.161659 1.44446
O  1.983885 -2.106466 0.84709
N  3.623097 0.19932 -0.459898
N  4.283155 1.09658 0.289515
C  2.073336 1.548516 0.312218
C  2.308543 0.416073 -0.468666
C  3.37575 1.905768 0.771677
C  0.866427 2.300244 0.591837
C  -0.399794 1.977143 -0.149609
C  3.770472 3.03771 1.650625
C  0.461262 -1.074667 -0.659475
C  4.335101 -0.889091 -1.079102
C  -0.544532 2.053441 -1.528001
C  -1.73218 1.71412 -2.186785
C  -1.505291 1.613552 0.611933
C  0.834347 -1.966516 0.510478
C  -0.283864 -2.639219 1.217455
C  -2.787331 1.292715 -1.378616
C  -2.690897 1.254484 0.005258
C  -1.83066 1.821245 -3.676875
C  -1.610335 -2.531936 0.803631
C  0.004484 -3.415312 2.339748
C  -2.334545 -3.957811 2.613881
C  -2.617605 -3.186799 1.491319
C  -1.006054 -4.059864 3.02478
C  -3.427299 -4.640861 3.378706
H  4.854577 3.063214 1.742429
H  3.429291 3.992569 1.252957
H  3.336179 2.93885 2.644433
H  -0.335613 -0.39564 -0.352603
H  0.05506 -1.692157 -1.464607
H  3.9994 -1.03559 -2.103089
H  5.387956 -0.625916 -1.083533
H  4.192762 -1.811987 -0.520399
H  -1.420763 1.589069 1.690108
H  -3.541015 0.949236 0.598902
H  -1.063378 1.218629 -4.162922
H  -2.798194 1.496638 -4.045887
H  -1.678099 2.851866 -3.998315
H  -1.883016 -1.939216 -0.060162
H  1.030145 -3.506926 2.670861
H  -3.640605 -3.095877 1.147705
H  -0.761859 -4.656637 3.89512
H  -4.317447 -4.786066 2.7683
H  -3.109483 -5.61639 3.745578
H  -3.720135 -4.048617 4.247886
totalener: -2106.06452805 hartree
nucrepener: 3151.89105567 hartree
electener: -5257.95558372 hartree
oneelecener: -9154.26695806 hartree
twoeener: 3896.31137434 hartree
kineticenergy: 2099.78514526 hartree
xcener: -157.009858933533 hartree
chargesum: 0.0000000
charge: -0.048582 -0.069722 -0.326407 -0.343043 -0.348317 0.144009 -0.290323 -0.197647 0.221330 0.069944 0.308735 0.109922 -0.239284 0.083961 -0.183169 -0.080855 -0.038079 -0.093184 0.299150 -0.029248 0.145763 -0.222999 -0.229287 -0.159577 -0.111324 0.025414 -0.148927 -0.134409 -0.202672 0.095118 0.093205 0.095659 0.009708 0.133955 0.106602 0.116354 0.119227 0.124107 0.122939 0.102448 0.085969 0.108398 0.119862 0.139122 0.114666 0.117858 0.086286 0.092481 0.104864
qa: -0.0486 -0.0697 -0.3264 -0.3430 -0.3483 0.1440 -0.2903 -0.1976 0.2213 0.0699 0.3087 0.1099 -0.2393 0.0840 -0.1832 -0.0809 -0.0381 -0.0932 0.2991 -0.0292 0.1458 -0.2230 -0.2293 -0.1596 -0.1113 0.0254 -0.1489 -0.1344 -0.2027 0.0951 0.0932 0.0957 0.0097 0.1340 0.1066 0.1164 0.1192 0.1241 0.1229 0.1024 0.0860 0.1084 0.1199 0.1391 0.1147 0.1179 0.0863 0.0925 0.1049
va: 1.2952 1.2545 2.0828 2.1524 2.1199 3.3130 2.9273 3.4702 4.0488 4.0382 3.9624 3.4152 3.9522 3.8633 3.8991 3.9113 3.7294 3.9205 3.9023 3.6734 3.7644 3.9914 3.9436 4.0049 4.0211 3.7885 4.0325 3.9627 3.9096 1.0153 1.0018 1.0023 1.0462 0.9971 0.9929 1.0121 0.9965 1.0179 1.0174 1.0012 1.0246 1.0003 1.0044 1.0246 1.0102 1.0079 1.0061 1.0026 0.9936
dispcorr: -0.029655147 hartree
energy: -2106.094183194466
dipole: 3.08885 -4.73129 -1.64244 -20.48957 18.53849 -1.95108 15.70707 -16.08934 -0.38228
magnitude: 2.57885 au
magnitude: 6.55491 debye
