program: Orca
programVersion: 5.0.2
elementType: Cl Cl O O O N N C C C C C C C C C C C C C C C C C C C C C C H H H H H H H H H H H H H H H H H H H H
charge: 0
multiplicity: 1
keywords: wb97x-d3
keywords: def2-TZVPP
keywords: def2/J RIJCOSX
keywords: DEFGRID2
keywords: scfconv7
keywords: smallprint printgap noloewdin
keywords: NOSOSCF
formula: C22H20Cl2N2O3
InChI: InChI=1/C22H20Cl2N2O3/c1-12-5-7-15(8-6-12)18(27)11-29-22-19(14(3)25-26(22)4)21(28)16-9-10-17(23)13(2)20(16)24/h5-10H,11H2,1-4H3
49 atoms
Cl -0.840362 0.306232 -1.150339
Cl -3.619284 4.797229 0.005669
O  3.126893 -1.256379 0.967376
O  0.739125 0.350276 2.337919
O  1.794317 -2.215507 -1.151126
N  3.800233 0.256468 -0.595307
N  3.489653 1.436789 -1.158664
C  1.936325 0.884052 0.381922
C  2.913826 -0.111893 0.325801
C  2.368882 1.821154 -0.605475
C  0.81736 0.96932 1.293574
C  -0.299207 1.907285 0.939139
C  1.762041 3.115241 -1.026028
C  2.039597 -2.116848 1.207773
C  4.92243 -0.511896 -1.067431
C  -1.120037 1.697403 -0.158873
C  -2.174032 2.550244 -0.497447
C  -0.56357 2.990643 1.764901
C  1.353138 -2.548456 -0.078673
C  0.14055 -3.392145 0.046831
C  -2.365416 3.649686 0.337484
C  -1.581989 3.870818 1.460544
C  -3.025878 2.266403 -1.6953
C  -0.360507 -3.808637 1.278883
C  -0.525086 -3.786201 -1.112383
C  -2.160683 -4.995787 0.191492
C  -1.492985 -4.599898 1.346872
C  -1.658596 -4.57266 -1.037236
C  -3.373605 -5.872423 0.271174
H  2.462995 3.64296 -1.67002
H  0.840006 2.965163 -1.588109
H  1.523767 3.757434 -0.17893
H  2.463236 -2.997722 1.697249
H  1.32812 -1.664497 1.901285
H  5.655382 -0.671171 -0.278074
H  4.588255 -1.476154 -1.446796
H  5.383297 0.051805 -1.871967
H  0.046015 3.151921 2.644061
H  -1.775878 4.725595 2.092736
H  -3.815347 3.000987 -1.816543
H  -2.427062 2.26291 -2.606667
H  -3.490452 1.283504 -1.614779
H  0.117931 -3.514685 2.204054
H  -0.149463 -3.466081 -2.074926
H  -1.867977 -4.908202 2.315127
H  -2.166466 -4.86297 -1.948858
H  -3.982817 -5.799831 -0.628589
H  -3.087574 -6.919641 0.388335
H  -4.001672 -5.612003 1.122757
totalener: -2106.06862769 hartree
nucrepener: 3123.93849237 hartree
electener: -5230.00712006 hartree
oneelecener: -9099.25956264 hartree
twoeener: 3869.25244257 hartree
kineticenergy: 2099.78793280 hartree
xcener: -157.011198149625 hartree
chargesum: -0.0000000
charge: -0.060781 -0.071530 -0.311993 -0.371993 -0.344193 0.119258 -0.291255 -0.231197 0.258459 0.115067 0.307336 0.162884 -0.275405 -0.033016 -0.171934 -0.119284 -0.038863 -0.145557 0.310830 -0.060569 0.101965 -0.140574 -0.214057 -0.125750 -0.118590 0.025365 -0.150523 -0.126345 -0.203954 0.110112 0.099282 0.097396 0.131503 0.140915 0.107279 0.113426 0.112374 0.121271 0.120806 0.085529 0.101902 0.102299 0.117421 0.135288 0.113928 0.114709 0.085567 0.103213 0.091978
qa: -0.0608 -0.0715 -0.3120 -0.3720 -0.3442 0.1193 -0.2913 -0.2312 0.2585 0.1151 0.3073 0.1629 -0.2754 -0.0330 -0.1719 -0.1193 -0.0389 -0.1456 0.3108 -0.0606 0.1020 -0.1406 -0.2141 -0.1257 -0.1186 0.0254 -0.1505 -0.1263 -0.2040 0.1101 0.0993 0.0974 0.1315 0.1409 0.1073 0.1134 0.1124 0.1213 0.1208 0.0855 0.1019 0.1023 0.1174 0.1353 0.1139 0.1147 0.0856 0.1032 0.0920
va: 1.2915 1.2541 2.1307 2.0991 2.1148 3.3244 2.9323 3.4069 4.1139 3.9308 3.9266 3.3638 3.9802 3.8443 3.8987 3.9545 3.7324 4.0083 3.7973 3.6963 3.8727 4.0207 3.9304 3.9966 4.0101 3.7908 4.0262 3.9621 3.9110 1.0210 0.9908 0.9914 0.9954 1.0105 0.9890 1.0012 1.0131 1.0150 1.0141 1.0261 1.0005 1.0016 1.0127 1.0276 1.0095 1.0087 1.0067 0.9933 1.0021
dispcorr: -0.028901014 hartree
energy: -2106.097528706903
dipole: 3.79517 -4.40664 -0.61147 -23.26743 22.02907 -1.23835 -1.92082 2.11785 0.19703
magnitude: 1.39508 au
magnitude: 3.54600 debye
