program: Orca
programVersion: 5.0.2
elementType: Cl Cl O O O N N C C C C C C C C C C C C C C C C C C C C C C H H H H H H H H H H H H H H H H H H H H
charge: 0
multiplicity: 1
keywords: wb97x-d3
keywords: def2-TZVPP
keywords: def2/J RIJCOSX
keywords: DEFGRID2
keywords: scfconv7
keywords: smallprint printgap noloewdin
keywords: NOSOSCF
formula: C22H20Cl2N2O3
InChI: InChI=1/C22H20Cl2N2O3/c1-12-5-7-15(8-6-12)18(27)11-29-22-19(14(3)25-26(22)4)21(28)16-9-10-17(23)13(2)20(16)24/h5-10H,11H2,1-4H3
49 atoms
Cl 0.457084 2.781863 -2.691104
Cl -3.648531 5.444741 -0.380192
O  2.148622 -1.627507 -0.887677
O  -0.720149 -0.42547 -1.267152
O  2.334809 -2.808611 1.525309
N  3.216512 0.040356 0.257926
N  3.054679 1.284549 0.736606
C  1.131172 0.567405 -0.197344
C  2.105325 -0.436934 -0.297785
C  1.816649 1.620506 0.483017
C  -0.199277 0.548457 -0.757475
C  -1.018467 1.806208 -0.677608
C  1.336904 2.959897 0.926418
C  1.192823 -2.607367 -0.549981
C  4.50467 -0.600385 0.340809
C  -0.826219 2.877655 -1.533373
C  -1.609295 4.034673 -1.499674
C  -2.055803 1.870922 0.240678
C  1.436245 -3.204201 0.823293
C  0.525722 -4.293469 1.257261
C  -2.618922 4.061288 -0.538608
C  -2.848439 2.997874 0.321458
C  -1.346354 5.157217 -2.454938
C  -0.587976 -4.680755 0.515887
C  0.79759 -4.95999 2.452134
C  -1.139849 -6.372274 2.149933
C  -1.407512 -5.705076 0.959625
C  -0.020995 -5.983205 2.886135
C  -2.040109 -7.462275 2.647512
H  0.397108 2.903749 1.473529
H  2.088344 3.404434 1.576275
H  1.185172 3.635474 0.084871
H  0.179437 -2.208054 -0.628391
H  1.290291 -3.389668 -1.30656
H  5.0614 -0.481014 -0.588305
H  5.054899 -0.125456 1.146797
H  4.383956 -1.656084 0.559201
H  -2.236783 1.037016 0.905941
H  -3.648556 3.054442 1.045706
H  -2.04674 5.975678 -2.323448
H  -0.338541 5.552165 -2.322959
H  -1.421177 4.812347 -3.486339
H  -0.839971 -4.186448 -0.413445
H  1.66065 -4.669812 3.036141
H  -2.269393 -5.989007 0.368538
H  0.209912 -6.492353 3.814175
H  -2.664028 -7.865975 1.851682
H  -1.470752 -8.285925 3.077775
H  -2.70622 -7.088607 3.427567
totalener: -2106.06983165 hartree
nucrepener: 2985.75964942 hartree
electener: -5091.82948107 hartree
oneelecener: -8822.66029942 hartree
twoeener: 3730.83081835 hartree
kineticenergy: 2099.77758543 hartree
xcener: -157.008294808015 hartree
chargesum: -0.0000000
charge: -0.056922 -0.072137 -0.310678 -0.381255 -0.360978 0.122641 -0.283216 -0.251266 0.258177 0.101807 0.341590 0.139029 -0.278264 -0.041442 -0.172882 -0.083036 -0.049433 -0.146692 0.350204 -0.075567 0.116100 -0.149036 -0.225009 -0.135609 -0.107340 0.029175 -0.150463 -0.141608 -0.203336 0.100868 0.111659 0.097859 0.137494 0.128062 0.109767 0.112482 0.116979 0.118041 0.119595 0.085931 0.101526 0.105314 0.123438 0.136186 0.113955 0.116219 0.085569 0.093061 0.103444
qa: -0.0569 -0.0721 -0.3107 -0.3813 -0.3610 0.1226 -0.2832 -0.2513 0.2582 0.1018 0.3416 0.1390 -0.2783 -0.0414 -0.1729 -0.0830 -0.0494 -0.1467 0.3502 -0.0756 0.1161 -0.1490 -0.2250 -0.1356 -0.1073 0.0292 -0.1505 -0.1416 -0.2033 0.1009 0.1117 0.0979 0.1375 0.1281 0.1098 0.1125 0.1170 0.1180 0.1196 0.0859 0.1015 0.1053 0.1234 0.1362 0.1140 0.1162 0.0856 0.0931 0.1034
va: 1.2857 1.2528 2.1263 2.1042 2.1129 3.3421 2.9169 3.4969 4.1325 3.9214 3.8918 3.5162 3.9846 3.8701 3.8892 3.9921 3.7479 4.0191 3.8008 3.7273 3.8560 4.0336 3.9380 3.9971 4.0185 3.7786 4.0284 3.9705 3.9092 0.9894 1.0210 0.9939 1.0148 1.0002 0.9884 1.0099 1.0116 1.0121 1.0149 1.0261 1.0001 1.0000 1.0097 1.0263 1.0103 1.0082 1.0068 1.0016 0.9938
dispcorr: -0.026517827 hartree
energy: -2106.096349474362
dipole: 6.04157 -6.52598 -0.48441 -31.66910 30.30430 -1.36480 14.85292 -14.43836 0.41456
magnitude: 1.50638 au
magnitude: 3.82892 debye
