program: Orca
programVersion: 5.0.2
elementType: Cl S S O O O O C C C C C C C C C C C C C C C C C C C C C C H H H H H H H H H H H H H H H H H H H
charge: 0
multiplicity: 1
keywords: wb97x-d3
keywords: def2-TZVPP
keywords: def2/J RIJCOSX
keywords: DEFGRID2
keywords: scfconv7
keywords: smallprint printgap noloewdin
keywords: NOSOSCF
formula: C22H19ClO4S2
InChI: InChI=1/C22H19ClO4S2/c1-29(26,27)16-9-10-17(18(23)12-16)21(25)19-20(24)13-7-8-14(11-13)22(19)28-15-5-3-2-4-6-15/h2-6,9-10,12-14H,7-8,11H2,1H3
48 atoms
Cl 0.503902 -3.023107 -1.698216
S  -3.506892 0.543683 0.344895
S  4.021778 -1.05452 1.819882
O  0.101886 1.887314 -3.026714
O  -1.462392 -1.023045 -2.22388
O  4.911863 -2.029729 1.19216
O  4.557738 0.250102 2.204641
C  -3.238554 2.891613 -0.94723
C  -1.484421 3.560615 -2.350746
C  -3.004722 3.415116 -2.357007
C  -2.406656 3.866995 -0.087762
C  -1.19725 4.218682 -0.974483
C  -2.633045 1.519816 -0.805025
C  -0.880571 2.186559 -2.363388
C  -1.515175 1.193182 -1.488933
C  -0.912436 -0.177943 -1.556614
C  0.358983 -0.421468 -0.81881
C  -2.333495 -0.602309 1.015713
C  1.023878 -1.653841 -0.794417
C  0.894884 0.621816 -0.062768
C  -1.413371 -0.149923 1.956679
C  -2.394841 -1.950013 0.677268
C  2.158233 -1.835723 -0.017074
C  2.023391 0.462207 0.716637
C  2.632555 -0.779893 0.740277
C  -0.522546 -1.045682 2.527005
C  -1.503986 -2.840707 1.257324
C  -0.56341 -2.388182 2.173677
C  3.278977 -1.808012 3.24131
H  -4.290305 2.878291 -0.656085
H  -1.087124 4.139309 -3.184149
H  -3.379072 2.748337 -3.135519
H  -3.483152 4.387708 -2.484006
H  -2.122536 3.436075 0.872825
H  -3.008093 4.752422 0.120091
H  -1.109743 5.296739 -1.105305
H  -0.253593 3.876092 -0.547248
H  0.397758 1.582461 -0.045991
H  -1.38367 0.897556 2.229052
H  -3.123161 -2.299472 -0.042593
H  2.648723 -2.800211 -0.0055
H  2.395487 1.290463 1.302447
H  0.205171 -0.693301 3.246261
H  -1.540279 -3.886971 0.985542
H  0.138189 -3.083326 2.616476
H  2.545374 -1.130638 3.673992
H  2.806407 -2.745297 2.954015
H  4.075056 -2.001273 3.961502
elementType: Cl S O C H
totalener: -2407.38857109 hartree
nucrepener: 3486.59228572 hartree
electener: -5893.98085681 hartree
twoeener: 4346.63545105 hartree
cpcmener: -0.06489198 hartree
kineticenergy: 2400.27715303 hartree
xcener: -170.396009043472 hartree
chargesum: -0.0000000
charge: -0.042210 -0.026626 0.866142 -0.476264 -0.372986 -0.558942 -0.561226 0.229249 0.261595 -0.274784 -0.204240 -0.245678 -0.059277 0.142673 -0.064041 0.177193 0.052535 0.097702 0.028273 -0.097151 -0.157087 -0.111904 -0.140498 -0.174255 0.032685 -0.142002 -0.184172 -0.137756 -0.258740 0.084615 0.073253 0.095381 0.098426 0.088545 0.101227 0.106467 0.098852 0.170217 0.148627 0.140699 0.118609 0.152239 0.172977 0.154015 0.163193 0.139057 0.140973 0.154423
qa: -0.0422 -0.0266 0.8661 -0.4763 -0.3730 -0.5589 -0.5612 0.2292 0.2616 -0.2748 -0.2042 -0.2457 -0.0593 0.1427 -0.0640 0.1772 0.0525 0.0977 0.0283 -0.0972 -0.1571 -0.1119 -0.1405 -0.1743 0.0327 -0.1420 -0.1842 -0.1378 -0.2587 0.0846 0.0733 0.0954 0.0984 0.0885 0.1012 0.1065 0.0989 0.1702 0.1486 0.1407 0.1186 0.1522 0.1730 0.1540 0.1632 0.1391 0.1410 0.1544
va: 1.2730 2.4752 5.5271 2.0097 2.0706 1.9052 1.9112 3.6616 3.6054 4.1057 3.9418 3.9577 3.9195 4.1486 3.3228 4.0489 3.3875 3.6228 4.0306 3.8992 3.9139 3.8956 4.1036 4.0576 3.7281 3.8247 3.8784 3.8012 3.8633 1.0137 1.0219 1.0159 1.0072 1.0203 1.0063 1.0026 1.0093 0.9804 1.0011 1.0107 1.0382 1.0160 0.9766 0.9979 0.9868 1.0082 1.0048 1.0125
dispcorr: -0.037088725 hartree
energy: -2407.425659819487
dipole: -9.20575 6.32511 -2.88064 20.48383 -19.17803 1.30580 12.77598 -9.27169 3.50430
magnitude: 4.72052 au
magnitude: 11.99861 debye
