program: Orca
programVersion: 5.0.2
elementType: Cl S S O O O O C C C C C C C C C C C C C C C C C C C C C C H H H H H H H H H H H H H H H H H H H
charge: 0
multiplicity: 1
keywords: wb97x-d3
keywords: def2-TZVPP
keywords: def2/J RIJCOSX
keywords: DEFGRID2
keywords: scfconv7
keywords: smallprint printgap noloewdin
keywords: NOSOSCF
formula: C22H19ClO4S2
InChI: InChI=1/C22H19ClO4S2/c1-29(26,27)16-9-10-17(18(23)12-16)21(25)19-20(24)13-7-8-14(11-13)22(19)28-15-5-3-2-4-6-15/h2-6,9-10,12-14H,7-8,11H2,1H3
48 atoms
Cl 1.00491 0.451532 2.045616
S  -2.938797 -1.456028 -0.15784
S  6.005933 -0.335254 0.149185
O  0.913394 1.650379 -1.283888
O  -0.398331 -2.092929 -0.422323
O  6.311324 -0.105655 1.56076
O  6.667274 -1.442925 -0.539722
C  -3.071415 1.293918 -0.634206
C  -1.217423 2.6770 -1.021049
C  -2.510524 2.234789 -1.692386
C  -2.908254 2.109992 0.66979
C  -1.662096 2.98234 0.428055
C  -2.206733 0.07171 -0.529088
C  -0.268798 1.512809 -1.017131
C  -0.841081 0.195927 -0.673818
C  0.033316 -0.953372 -0.478255
C  1.511957 -0.771849 -0.308156
C  -4.643916 -1.043424 0.125756
C  2.054369 -0.163305 0.816356
C  2.367914 -1.312659 -1.258303
C  -5.570158 -1.257475 -0.889198
C  -5.05866 -0.613817 1.381986
C  3.421001 -0.037658 0.980206
C  3.740214 -1.194494 -1.123787
C  4.248657 -0.545507 -0.009697
C  -6.915227 -1.01401 -0.651147
C  -6.404856 -0.369533 1.610808
C  -7.332018 -0.568113 0.595845
C  6.321234 1.160119 -0.74984
H  -4.107355 1.031269 -0.825799
H  -0.733729 3.52832 -1.498928
H  -2.365331 1.758115 -2.66301
H  -3.186049 3.08109 -1.827947
H  -2.813916 1.474769 1.550021
H  -3.798712 2.723063 0.809613
H  -1.910435 4.040606 0.504783
H  -0.86924 2.791551 1.151786
H  1.957736 -1.811538 -2.126286
H  -5.242945 -1.600587 -1.862121
H  -4.336731 -0.463728 2.17424
H  3.822343 0.447614 1.859793
H  4.390535 -1.605042 -1.884189
H  -7.636447 -1.172706 -1.441701
H  -6.729065 -0.027636 2.584675
H  -8.381523 -0.378748 0.778703
H  7.391903 1.360891 -0.697826
H  6.01807 1.033369 -1.787338
H  5.768206 1.980244 -0.295719
elementType: Cl S O C H
totalener: -2407.39558683 hartree
nucrepener: 3279.75557027 hartree
electener: -5687.15115710 hartree
oneelecener: -9828.77417331 hartree
twoeener: 4141.62301621 hartree
cpcmener: -0.05621924 hartree
kineticenergy: 2400.27726728 hartree
xcener: -170.397230519066 hartree
chargesum: -0.0000000
charge: -0.067314 0.043806 0.863575 -0.467326 -0.430685 -0.564310 -0.564532 0.187871 0.248326 -0.248063 -0.199434 -0.246644 -0.102208 0.191633 -0.191284 0.348879 0.078213 0.118837 0.013570 -0.118445 -0.133158 -0.187826 -0.134589 -0.173019 0.005081 -0.175639 -0.170023 -0.109765 -0.240074 0.116461 0.069203 0.099252 0.099089 0.095623 0.104945 0.103285 0.094922 0.153656 0.140603 0.153528 0.133438 0.151924 0.162356 0.161958 0.164463 0.140574 0.139991 0.139275
qa: -0.0673 0.0438 0.8636 -0.4673 -0.4307 -0.5643 -0.5645 0.1879 0.2483 -0.2481 -0.1994 -0.2466 -0.1022 0.1916 -0.1913 0.3489 0.0782 0.1188 0.0136 -0.1184 -0.1332 -0.1878 -0.1346 -0.1730 0.0051 -0.1756 -0.1700 -0.1098 -0.2401 0.1165 0.0692 0.0993 0.0991 0.0956 0.1049 0.1033 0.0949 0.1537 0.1406 0.1535 0.1334 0.1519 0.1624 0.1620 0.1645 0.1406 0.1400 0.1393
va: 1.2593 2.6371 5.5324 2.0078 2.0344 1.9028 1.8987 3.6709 3.6402 4.0625 3.9169 3.9487 4.0200 3.9944 3.4064 3.8772 3.5512 3.6792 3.9872 4.0117 3.9436 3.9430 4.1177 4.0450 3.7588 3.9237 3.9228 3.8648 3.8696 0.9938 1.0256 1.0142 1.0066 1.0133 1.0082 1.0087 1.0221 1.0042 1.0080 0.9957 1.0307 1.0118 0.9894 0.9900 0.9871 1.0111 1.0052 1.0059
dispcorr: -0.029444211 hartree
energy: -2407.425031038677
dipole: -22.72819 17.54608 -5.18211 16.56272 -13.39673 3.16599 -8.00758 6.71818 -1.28940
magnitude: 6.20808 au
magnitude: 15.77969 debye
