program: Orca
programVersion: 5.0.2
elementType: Cl S S O O O O C C C C C C C C C C C C C C C C C C C C C C H H H H H H H H H H H H H H H H H H H
charge: 0
multiplicity: 1
keywords: wb97x-d3
keywords: def2-TZVPP
keywords: def2/J RIJCOSX
keywords: DEFGRID2
keywords: scfconv7
keywords: smallprint printgap noloewdin
keywords: NOSOSCF
formula: C22H19ClO4S2
InChI: InChI=1/C22H19ClO4S2/c1-29(26,27)16-9-10-17(18(23)12-16)21(25)19-20(24)13-7-8-14(11-13)22(19)28-15-5-3-2-4-6-15/h2-6,9-10,12-14H,7-8,11H2,1H3
48 atoms
Cl 1.041398 -0.452054 -2.207116
S  -2.911886 -1.200797 0.798684
S  6.042595 -0.515559 -0.173448
O  0.907504 2.057458 0.215454
O  -0.355076 -1.638739 1.233993
O  6.681332 -1.185822 0.955524
O  6.319106 -0.987126 -1.527608
C  -3.054846 1.3927 -0.247903
C  -1.230854 2.843955 -0.465175
C  -2.304514 2.183039 -1.313629
C  -3.233077 2.425155 0.891395
C  -2.029812 3.376614 0.747595
C  -2.183286 0.274262 0.246413
C  -0.264041 1.79497 0.014044
C  -0.821116 0.46067 0.305875
C  0.066019 -0.626852 0.702972
C  1.542777 -0.54831 0.451744
C  -4.633148 -0.98999 0.404477
C  2.083566 -0.502699 -0.827832
C  2.402017 -0.635213 1.540044
C  -5.122873 -1.456172 -0.811126
C  -5.49804 -0.465877 1.358775
C  3.450913 -0.507927 -1.031988
C  3.774824 -0.624254 1.364719
C  4.281608 -0.553424 0.076833
C  -6.480204 -1.3660 -1.082685
C  -6.854645 -0.38019 1.080092
C  -7.345061 -0.826893 -0.139432
C  6.42926 1.216689 -0.089215
H  -4.008658 1.016592 -0.606002
H  -0.671567 3.631543 -0.970802
H  -1.910264 1.557549 -2.116615
H  -2.965618 2.928823 -1.759644
H  -3.284044 1.953791 1.872822
H  -4.174802 2.954211 0.742207
H  -2.365148 4.391076 0.529897
H  -1.422861 3.433278 1.651739
H  1.99303 -0.693819 2.540209
H  -4.448219 -1.87795 -1.545283
H  -5.115961 -0.121733 2.311354
H  3.853836 -0.477645 -2.035504
H  4.428025 -0.676317 2.225377
H  -6.861852 -1.72049 -2.031284
H  -7.528471 0.034002 1.818697
H  -8.403826 -0.759174 -0.353581
H  7.506155 1.323781 -0.227573
H  5.900903 1.748408 -0.878436
H  6.141994 1.609495 0.884516
elementType: Cl S O C H
totalener: -2407.40309039 hartree
nucrepener: 3263.16502061 hartree
electener: -5670.56811100 hartree
oneelecener: -9795.51785072 hartree
twoeener: 4124.94973972 hartree
cpcmener: -0.04578585 hartree
kineticenergy: 2400.27149050 hartree
xcener: -170.392152954371 hartree
chargesum: -0.0000000
charge: -0.066892 0.045125 0.853818 -0.440810 -0.407073 -0.548134 -0.547810 0.178926 0.221426 -0.238340 -0.210444 -0.214081 -0.127415 0.175972 -0.163180 0.327505 0.090353 0.100597 0.006366 -0.116269 -0.131832 -0.162830 -0.129965 -0.172942 0.000368 -0.168818 -0.172053 -0.111064 -0.247384 0.114892 0.074612 0.091450 0.096033 0.095505 0.101564 0.100881 0.092960 0.148762 0.140866 0.145821 0.130690 0.150224 0.159123 0.159641 0.161584 0.138609 0.136900 0.136764
qa: -0.0669 0.0451 0.8538 -0.4408 -0.4071 -0.5481 -0.5478 0.1789 0.2214 -0.2383 -0.2104 -0.2141 -0.1274 0.1760 -0.1632 0.3275 0.0904 0.1006 0.0064 -0.1163 -0.1318 -0.1628 -0.1300 -0.1729 0.0004 -0.1688 -0.1721 -0.1111 -0.2474 0.1149 0.0746 0.0914 0.0960 0.0955 0.1016 0.1009 0.0930 0.1488 0.1409 0.1458 0.1307 0.1502 0.1591 0.1596 0.1616 0.1386 0.1369 0.1368
va: 1.2573 2.6365 5.5562 2.0403 2.0640 1.9205 1.9229 3.6582 3.7111 4.0527 3.9351 3.9507 4.0626 4.0328 3.3913 3.8943 3.5401 3.7021 3.9987 4.0141 3.9372 3.9416 4.1091 4.0447 3.7680 3.9238 3.9343 3.8730 3.8733 0.9949 1.0272 1.0208 1.0074 1.0111 1.0069 1.0040 1.0144 1.0067 1.0060 1.0012 1.0322 1.0135 0.9906 0.9907 0.9884 1.0115 1.0064 1.0059
dispcorr: -0.028786845 hartree
energy: -2407.431877237213
dipole: -23.40409 18.54654 -4.85755 19.66386 -16.41286 3.25100 5.02824 -5.10443 -0.07619
magnitude: 5.84556 au
magnitude: 14.85824 debye
