program: Gaussian 09
title: 000059346
version: EM64L-G09RevD.01
frameworkgroup: C1[X(C12H16ClNO2)]
method: RPBEPBE
basis: SDD
operation: Freq
keyword: #p
keyword: freq=noraman
keyword: PBEPBE/SDD
title: #p freq=noraman PBEPBE/SDD
converged: YES YES NO NO
title: Mulliken charges:
elementType: Cl O O N C C C C C C C C C C C C H H H H H H H H H H H H H H H H
charge: -0.030525 -0.296840 -0.223375 -0.264700 -0.448600 -0.211634 0.484922 0.275151 -0.325660 -0.393853 -0.198250 -0.740468 -0.220655 -0.215190 -0.244588 -0.678230 0.241836 0.230435 0.199564 0.210297 0.268262 0.233522 0.196055 0.191525 0.334278 0.266097 0.229207 0.227362 0.230888 0.208552 0.227826 0.236791
chargesum: 0.00000
title: Mulliken charges with hydrogens summed into heavy atoms:
elementType: Cl O O N C C C C C C C C C C C C
charge: -0.030525 -0.296840 -0.223375 -0.264700 0.023671 0.198226 0.484922 0.275151 -0.057398 -0.160331 0.189330 -0.140093 0.008552 0.012171 -0.013700 -0.005061
polarizability: 1.90774646e+02 1.58186914e+01 1.19699651e+02 -1.37269717e+00 -6.79011032e+00 1.38431300e+02
1716.lowfreq: -11.7111 -6.2552 -5.2507 -0.0019 -0.0015 -0.0005 20.7278 36.2508 36.4808
frequency: 20.1095 36.2402 36.4614 49.9938 56.8579 78.2819 114.2024 124.7223 145.9641 158.5058 211.4120 242.8553 251.4764 263.6696 288.1463 373.3736 390.6160 406.3466 409.6233 497.9323 498.9572 541.9916 568.6961 607.3668 615.0865 696.1243 716.8118 747.3425 767.0569 783.3695 814.7005 837.5399 862.6169 908.6367 924.0842 938.4022 953.5235 967.2328 987.7536 992.1112 1024.8957 1029.7150 1065.9399 1078.6507 1081.9419 1103.8178 1119.5332 1139.4604 1172.2011 1174.1527 1186.0317 1191.5127 1208.9401 1246.0721 1252.4222 1285.1719 1315.6144 1334.8341 1347.2913 1363.5900 1381.4728 1389.8518 1402.2250 1434.5182 1439.2654 1462.4707 1468.1188 1469.9208 1480.8585 1483.2012 1493.4913 1591.7163 1603.1005 1619.4853 2923.4117 2932.0765 2978.3492 2983.0520 2995.4372 3031.7778 3033.2055 3089.9462 3093.7674 3102.1338 3118.9031 3125.6188 3135.0051 3147.2186 3163.6704 3182.5739
redmass: 3.8156 4.0156 6.8647 2.1019 4.4658 5.1397 5.7722 3.1201 2.9719 4.0158 4.9096 1.3501 2.5110 7.3628 5.1454 2.5719 4.6720 2.8624 2.8309 3.5755 3.0522 4.1659 3.5675 3.9813 5.5275 1.8470 5.8789 5.7481 1.8750 2.6043 1.0892 1.2641 3.4695 1.4715 2.4297 1.8512 2.1156 1.3797 2.5374 1.8917 2.2582 2.9541 2.7287 3.7572 1.7245 2.7403 2.1272 1.4686 1.0568 1.1080 1.1609 1.2911 2.3761 1.6741 1.1698 1.3313 1.3416 1.3030 1.3156 2.0002 8.4988 1.2617 1.3789 1.0847 2.2653 1.0405 1.0872 1.1100 1.0707 2.1245 1.0797 6.4221 6.8648 8.5596 1.0561 1.0558 1.1065 1.1041 1.0360 1.0591 1.0601 1.1015 1.0991 1.1012 1.1079 1.0854 1.0884 1.0941 1.0989 1.0969
irintensity: 0.1738 0.7590 0.1960 1.9594 2.0563 1.4815 7.2642 4.1536 5.6585 3.9395 1.4978 1.9018 1.2557 0.7983 3.8625 3.2297 0.7281 0.9196 3.1622 0.9170 13.7632 5.1303 3.4106 21.5319 1.8008 46.3377 7.4479 44.6181 37.4925 5.9575 4.0773 2.6158 15.9236 5.0159 10.7151 7.6806 2.0062 0.2235 0.5236 0.1516 13.4523 33.1593 140.2863 51.3293 3.3802 16.3409 33.9364 6.7705 0.4544 2.4306 5.1289 49.2230 49.9137 49.1310 4.8050 10.5841 6.1476 21.7755 10.8282 132.9709 0.9393 22.5284 11.6959 16.3454 3.2181 10.8557 8.5983 25.2880 6.0988 64.8959 3.9401 13.0876 58.2492 132.6341 20.5341 116.7641 72.8287 20.2794 17.7769 8.5692 40.9726 21.5798 33.3618 33.2059 8.6427 4.8642 3.9592 30.5610 27.1090 2.1911
temp: 298.150 k
press: 1.00000 atm
elementType: 17 8 8 7 6 6 6 6 6 6 6 6 6 6 6 6 1 1 1 1 1 1 1 1 1 1 1 1 1 1 1 1
symmnumber: 1
zpe: 678066.3 jmol-1
zpe.correction: 0.258262 hartree
zpe.thermalcorrener: 0.275109 hartree
zpe.thermalcorrenthalpy: 0.276053 hartree
zpe.thermalcorrgfe: 0.210622 hartree
zpe.sumelectzpe: -1130.900398 hartree
zpe.sumelectthermal: -1130.883550 hartree
zpe.sumelectthermalent: -1130.882606 hartree
zpe.sumelectthermalfe: -1130.948038 hartree
dipole: 1.3567 6.4097 -2.9659
dipole: 7.1917
quadrupole: -97.3596 -109.2740 -92.5996
quadrupole: -6.0923 0.4193 5.6603
quadrupole: 2.3848 -9.5296 7.1448 -6.0923 0.4193 5.6603
hfenergy: -1131.1586595 hartree
pointgroup: C01 [X(C12H16Cl1N1O2)]
dipole: -0.314397 2.5198947 1.2478134 debye
polarizability: 188.6103724|-18.2123139|120.9695942|-5.8222804|8.1338005|139.3256303 unknown
InChI: InChI=1S/C12H16ClNO2/c1-2-16-9-8-14(12(15)10-13)11-6-4-3-5-7-11/h3-7H,2,8-10H2,1H3
charge 0 multiplicity 1
32 atoms
Cl 3.087177 -2.850728 -0.550292
O  2.180815 1.530297 0.140502
O  0.18654 -2.196636 -0.877921
N  -0.034302 -0.448366 0.660903
C  0.568873 0.499593 1.631661
C  1.024003 1.819718 0.988936
C  -1.416092 -0.204919 0.286012
C  0.70004 -1.454882 -0.000049
C  -1.777875 -0.041741 -1.074019
C  -2.409634 -0.11043 1.291726
C  2.615244 2.687201 -0.66249
C  2.163892 -1.5915 0.463501
C  -3.121226 0.221125 -1.417663
C  -3.750208 0.163806 0.942066
C  -4.111902 0.331789 -0.414134
C  3.803245 2.241218 -1.513273
H  1.42554 0.031505 2.14343
H  -0.178163 0.734442 2.409728
H  1.302184 2.544393 1.787126
H  0.197763 2.257881 0.387997
H  -1.015566 -0.142812 -1.85042
H  -2.144483 -0.278154 2.341963
H  1.771074 3.028913 -1.300708
H  2.89757 3.523396 0.014678
H  2.698502 -0.637216 0.347723
H  2.220574 -1.946637 1.505634
H  -3.393696 0.339312 -2.472191
H  -4.511427 0.230402 1.72725
H  -5.152909 0.537529 -0.685896
H  4.158147 3.076751 -2.143373
H  4.63825 1.907681 -0.873334
H  3.515248 1.40407 -2.172073
