program: Gaussian 09
title: 000059355
version: EM64L-G09RevD.01
frameworkgroup: C1[X(C22H27NO2)]
method: RPBEPBE
basis: SDD
operation: Freq
keyword: #p
keyword: freq=noraman
keyword: PBEPBE/SDD
title: #p freq=noraman PBEPBE/SDD
converged: YES YES NO NO
title: Mulliken charges:
elementType: O O N C C C C C C C C C C C C C C C C C C C C C C H H H H H H H H H H H H H H H H H H H H H H H H H H H
charge: -0.266426 -0.247629 -0.127354 0.021580 -0.488627 -0.466324 -0.365519 -0.471087 -0.326525 -0.283467 -0.700332 -0.526163 0.262630 0.466487 0.490393 -0.416686 -0.432755 -0.390668 -0.351258 -0.228521 -0.226609 -0.241036 -0.227171 -0.243420 -0.243777 0.223244 0.213519 0.218224 0.219000 0.219965 0.172351 0.227161 0.215667 0.221618 0.210160 0.179048 0.236704 0.232226 0.225492 0.221283 0.208886 0.239371 0.227875 0.229694 0.281055 0.250971 0.224562 0.225234 0.225593 0.225190 0.228041 0.228131
chargesum: 0.00000
title: Mulliken charges with hydrogens summed into heavy atoms:
elementType: O O N C C C C C C C C C C C C C C C C C C C C C C
charge: -0.266426 -0.247629 -0.127354 0.244824 -0.056884 -0.027359 0.033993 -0.033803 0.062683 0.185463 -0.044670 -0.286793 0.262630 0.466487 0.490393 -0.188811 -0.203062 -0.109613 -0.100287 -0.003959 -0.001375 -0.015443 -0.001980 -0.015379 -0.015646
polarizability: 2.52015250e+02 1.53901716e-01 2.56841845e+02 -1.24259643e+01 -1.24090944e+01 2.18606095e+02
1716.lowfreq: -12.9479 -7.1210 -0.0006 -0.0005 -0.0002 0.4015 4.3149 10.2019 16.7257
frequency: -9.6452 10.2004 16.5358 22.8847 33.2105 35.5888 50.2788 56.6005 73.4917 88.5635 107.6216 155.4622 164.3101 180.8223 206.5643 220.3508 232.3166 239.5248 245.6429 261.4624 278.8454 298.1061 331.3050 350.4611 385.1220 401.6507 404.1498 427.7287 477.0340 498.6204 500.5848 546.4516 563.4663 602.5731 613.3924 615.4041 628.1687 694.6347 704.4782 707.9453 726.0845 740.1011 752.8840 774.1184 795.8750 798.7542 825.8563 841.4349 848.0746 857.4900 859.2188 859.7674 897.9388 911.8078 921.3188 929.6141 944.6066 955.1008 963.3805 972.5123 981.9663 983.7520 989.9639 991.2348 993.9727 1001.2283 1026.2769 1027.7552 1030.0414 1053.6581 1069.8474 1079.3035 1088.8059 1095.2701 1103.2892 1105.8057 1124.9515 1149.8404 1160.9809 1171.5183 1172.2548 1180.4541 1189.2433 1189.7198 1194.4430 1194.9641 1197.9845 1204.3705 1220.2015 1247.1949 1249.3875 1276.4841 1294.6208 1297.3876 1299.1586 1309.9198 1328.8652 1337.5144 1341.3773 1344.6831 1355.1173 1359.6744 1376.6439 1382.0069 1385.3905 1386.0004 1440.1976 1442.2513 1442.5541 1462.4251 1469.3423 1470.5017 1472.8459 1475.3588 1478.7537 1482.1866 1486.8201 1494.7400 1591.5125 1593.8491 1606.5896 1612.0692 1630.8568 2826.4117 2840.1891 2902.9756 2983.6866 2993.1954 3002.3696 3007.5163 3012.2387 3012.9172 3038.1018 3046.9006 3050.8641 3058.0989 3073.6569 3078.8726 3084.1288 3088.3410 3116.9363 3118.2305 3126.1499 3127.8601 3139.2918 3140.4740 3151.4920 3153.6816 3163.6002 3166.0306
redmass: 4.9716 3.6377 4.1616 3.9908 4.3630 3.9235 2.6566 4.6783 2.6287 4.2524 6.1686 5.0941 2.4249 3.0516 4.0662 2.5246 2.9024 3.2314 3.4837 1.3531 4.3725 3.7401 3.8567 2.4137 3.2751 2.8014 2.8652 2.3117 3.4984 3.5039 3.5780 6.3012 2.4389 2.4201 6.3454 6.3436 4.8521 4.0015 2.0601 1.8390 2.9191 2.4742 2.0194 2.9115 1.1748 2.6348 1.9482 3.4332 1.2659 2.3283 1.5853 2.1756 2.0523 1.7984 2.3567 1.5525 2.0446 2.4873 2.2416 1.3938 1.8093 1.3876 5.5866 5.8374 1.3477 1.3191 2.2554 1.9995 2.2169 1.8311 2.1691 1.6493 1.6049 2.0768 3.2441 2.0770 1.8135 1.9153 1.4933 1.1026 1.0734 2.5607 1.2581 1.3560 1.8028 1.2712 1.4429 2.6112 1.2867 1.3157 1.4504 1.2082 1.2749 1.3380 1.5855 1.2867 1.3523 1.2805 1.3085 1.4537 1.4776 1.4870 1.4065 6.7539 6.1458 1.2645 2.1771 1.7767 1.2011 1.0881 1.0518 1.0808 1.0660 1.0863 2.2015 2.2285 1.0730 1.0857 6.1308 6.0381 6.0224 5.9701 9.0356 1.0717 1.0711 1.0829 1.0354 1.0599 1.0594 1.0595 1.0859 1.0653 1.0873 1.0841 1.1005 1.1023 1.1073 1.0990 1.1050 1.1004 1.0864 1.0860 1.0870 1.0872 1.0925 1.0925 1.0952 1.0955 1.1013 1.1007
irintensity: 0.0580 0.0909 0.4137 0.1353 0.8558 0.1964 0.1927 0.2827 0.4829 0.6270 0.5379 0.7586 2.4840 1.7235 4.4484 2.8966 3.2854 3.4771 0.2111 0.7437 0.1688 0.2276 11.3521 1.1625 2.2213 0.1821 0.1602 4.3784 5.1022 2.5543 14.6816 12.3493 3.8160 2.9678 1.2553 0.0883 21.7698 7.5619 42.6467 53.0275 21.8364 17.2924 26.9677 10.8388 6.1309 19.8053 5.1798 0.3240 0.1387 0.4750 0.7718 1.7688 7.8425 14.7174 3.0398 5.8755 4.6441 22.1045 4.4216 0.1773 23.3611 0.2497 0.5759 4.4314 0.3942 0.4591 9.6687 1.5498 9.7016 31.9388 34.8004 6.2109 21.9013 22.3322 470.7904 7.9397 0.7751 18.1264 12.6744 1.1884 0.8915 5.9511 1.3862 0.9321 3.6541 2.7183 11.9243 36.5890 4.0032 2.7508 16.4358 3.0915 20.2365 2.3089 84.1146 1.3850 4.2793 20.8656 12.4691 2.2246 9.5042 9.5848 1.1255 2.8091 0.0488 22.2098 21.3916 2.7195 11.4695 7.2864 8.0870 14.9303 8.1983 5.9126 33.7652 17.7073 1.2812 6.8054 5.9044 1.1615 13.8331 7.7755 132.1822 70.7185 144.3534 62.1585 33.4826 18.2798 36.5141 13.4296 32.7393 34.6321 54.2174 7.1143 11.4897 31.7285 33.0947 56.0550 47.2530 42.0856 6.2565 5.2992 2.0661 1.0075 23.0876 30.1439 13.4282 30.6038 29.2850 16.4814
temp: 298.150 k
press: 1.00000 atm
elementType: 8 8 7 6 6 6 6 6 6 6 6 6 6 6 6 6 6 6 6 6 6 6 6 6 6 1 1 1 1 1 1 1 1 1 1 1 1 1 1 1 1 1 1 1 1 1 1 1 1 1 1 1
symmnumber: 1
zpe: 1150263.8 jmol-1
zpe.correction: 0.438112 hartree
zpe.thermalcorrener: 0.461376 hartree
zpe.thermalcorrenthalpy: 0.462321 hartree
zpe.thermalcorrgfe: 0.380778 hartree
zpe.sumelectzpe: -1057.879117 hartree
zpe.sumelectthermal: -1057.855853 hartree
zpe.sumelectthermalent: -1057.854909 hartree
zpe.sumelectthermalfe: -1057.936452 hartree
dipole: -1.1642 0.2558 1.4081
dipole: 1.8448
quadrupole: -144.0200 -140.6409 -145.7692
quadrupole: -2.9592 1.4233 -1.8592
quadrupole: -0.5433 2.8358 -2.2925 -2.9592 1.4233 -1.8592
hfenergy: -1058.3172296 hartree
pointgroup: C01 [X(C22H27N1O2)]
dipole: 0.4989727 0.2664017 -0.4548229 debye
polarizability: 253.1221022|3.8760408|233.2287293|-6.2954341|24.2275833|241.1123582 unknown
InChI: InChI=1S/C22H27NO2/c1-2-23-16-9-14-20(23)15-17-25-22(24)21(18-10-5-3-6-11-18)19-12-7-4-8-13-19/h3-8,10-13,20-21H,2,9,14-17H2,1H3
charge 0 multiplicity 1
52 atoms
O  0.526311 -0.742748 0.424844
O  -1.042892 -0.68147 2.140886
N  4.649752 -1.033014 -0.722679
C  3.565618 -0.708755 0.265392
C  4.31823 -0.259614 1.559388
C  5.811878 -0.587147 1.287461
C  5.917529 -0.429597 -0.24134
C  2.648582 -1.939793 0.4669
C  4.297644 -0.744516 -2.128239
C  1.378124 -1.649879 1.264267
C  5.296158 -1.353491 -3.130198
C  -1.461437 0.54135 0.00807
C  -0.678587 -0.335594 0.992625
C  -1.755077 1.945888 0.562262
C  -2.736006 -0.207449 -0.431837
C  -1.804523 3.026572 -0.355744
C  -2.803638 -0.762701 -1.733458
C  -2.015914 2.200961 1.932592
C  -3.838824 -0.366944 0.443915
C  -2.112339 4.333666 0.080011
C  -3.956363 -1.461502 -2.159338
C  -2.319541 3.510854 2.369285
C  -4.989119 -1.067345 0.020368
C  -2.37197 4.581103 1.448087
C  -5.053765 -1.615762 -1.282315
H  2.934622 0.13115 -0.108774
H  3.937257 -0.770244 2.462288
H  4.190773 0.826563 1.718425
H  6.039218 -1.631418 1.567811
H  6.503046 0.077747 1.83355
H  6.0018 0.654678 -0.515726
H  6.791955 -0.954426 -0.665121
H  3.223457 -2.727565 0.992102
H  2.368644 -2.357218 -0.518831
H  3.292834 -1.167227 -2.320035
H  4.218791 0.361086 -2.307215
H  0.794276 -2.564219 1.473322
H  1.579115 -1.140222 2.224433
H  5.384236 -2.442112 -2.96619
H  6.301597 -0.907185 -3.026344
H  4.95725 -1.178406 -4.167842
H  -0.81838 0.652176 -0.881729
H  -1.608241 2.840401 -1.419043
H  -1.951182 -0.6498 -2.414902
H  -1.968071 1.379147 2.654574
H  -3.796744 0.054021 1.453501
H  -2.147177 5.155673 -0.643946
H  -3.996689 -1.882903 -3.170154
H  -2.515361 3.693762 3.432055
H  -5.836095 -1.185122 0.705714
H  -2.609269 5.594696 1.790286
H  -5.948893 -2.156712 -1.609314
