program: Orca
programVersion: 5.0.2
elementType: P O O O O O N C C C H H H H H H H H
charge: 0
multiplicity: 1
keywords: wb97x-d3
keywords: def2-TZVPP
keywords: def2/J RIJCOSX
keywords: DEFGRID2
keywords: scfconv7
keywords: smallprint printgap noloewdin
keywords: NOSOSCF
formula: C3H8NO5P
InChI: InChI=1/C3H8NO5P/c5-3(6)1-4-2-10(7,8)9/h4-5,7-8H,1-2H2
18 atoms
P  -1.544747 0.037814 -0.093655
O  -1.01731 1.023998 -1.24106
O  -0.894526 0.541978 1.292866
O  -3.032442 -0.017699 -0.108671
O  2.833334 0.588948 1.231475
O  1.616855 1.067958 -0.569152
N  0.669421 -1.644172 -0.675567
C  -0.730889 -1.576518 -0.329346
C  1.628553 -1.19607 0.295331
C  1.98917 0.27081 0.267647
H  -1.303113 -2.067718 -1.119018
H  -0.916117 -2.16354 0.573406
H  0.84488 -1.245782 -1.588243
H  2.573851 -1.73005 0.150304
H  1.296991 -1.466177 1.299468
H  -0.042091 1.129327 -1.2282
H  -1.256209 1.376803 1.626498
H  3.088744 1.523413 1.168694
elementType: P O N C H
totalener: -891.61481697 hartree
nucrepener: 719.32699964 hartree
electener: -1610.94181662 hartree
oneelecener: -2655.74892208 hartree
twoeener: 1044.80710547 hartree
cpcmener: -0.05308754 hartree
kineticenergy: 888.56445702 hartree
xcener: -65.599413563562 hartree
chargesum: -0.0000000
charge: 0.860708 -0.439924 -0.376797 -0.702636 -0.298603 -0.472283 -0.322018 -0.100598 -0.033986 0.421542 0.128746 0.118636 0.147824 0.136391 0.122912 0.281171 0.255697 0.273220
qa: 0.8607 -0.4399 -0.3768 -0.7026 -0.2986 -0.4723 -0.3220 -0.1006 -0.0340 0.4215 0.1287 0.1186 0.1478 0.1364 0.1229 0.2812 0.2557 0.2732
va: 5.2263 2.0551 2.1081 1.8986 2.2066 2.0053 2.9958 3.9116 3.8875 4.1118 1.0081 1.0086 1.0231 1.0031 1.0103 1.0301 0.9968 0.9805
dispcorr: -0.007731023 hartree
energy: -891.622547996476
dipole: 5.69059 -2.52306 3.16753 -4.14197 4.16449 0.02252 0.87690 0.15706 1.03396
magnitude: 3.33209 au
magnitude: 8.46951 debye
