program: Orca
programVersion: 5.0.2
elementType: P O O O O O N C C C H H H H H H H H
charge: 0
multiplicity: 1
keywords: wb97x-d3
keywords: def2-TZVPP
keywords: def2/J RIJCOSX
keywords: DEFGRID2
keywords: scfconv7
keywords: smallprint printgap noloewdin
keywords: NOSOSCF
formula: C3H8NO5P
InChI: InChI=1/C3H8NO5P/c5-3(6)1-4-2-10(7,8)9/h4-5,7-8H,1-2H2
18 atoms
P  -1.335034 0.170795 -0.158091
O  -1.362129 0.572714 1.400556
O  -2.899591 -0.012399 -0.460207
O  -0.612878 1.128405 -1.039382
O  2.796706 0.977241 -0.669336
O  1.592317 0.724379 1.190448
N  0.611931 -1.78207 0.241638
C  -0.729706 -1.544659 -0.240025
C  1.683386 -1.079603 -0.408653
C  1.980673 0.305432 0.123803
H  -0.802752 -1.859225 -1.28488
H  -1.416426 -2.182686 0.319966
H  0.668061 -1.705725 1.247921
H  1.498709 -1.030893 -1.48319
H  2.614561 -1.647052 -0.293136
H  -0.479564 0.781719 1.745016
H  -3.324346 0.767633 -0.8444
H  3.020443 1.836857 -0.278518
elementType: P O N C H
totalener: -891.60932499 hartree
nucrepener: 721.34361541 hartree
electener: -1612.95294040 hartree
oneelecener: -2660.52210043 hartree
twoeener: 1047.56916003 hartree
cpcmener: -0.03773331 hartree
kineticenergy: 888.57678519 hartree
xcener: -65.596217654660 hartree
chargesum: 0.0000000
charge: 0.844726 -0.403400 -0.407650 -0.641571 -0.295921 -0.473662 -0.320233 -0.098939 -0.031988 0.397901 0.114565 0.130092 0.145708 0.115382 0.130070 0.270392 0.262023 0.262505
qa: 0.8447 -0.4034 -0.4077 -0.6416 -0.2959 -0.4737 -0.3202 -0.0989 -0.0320 0.3979 0.1146 0.1301 0.1457 0.1154 0.1301 0.2704 0.2620 0.2625
va: 5.2588 2.0798 2.1427 1.9172 2.1962 1.9993 2.9893 3.9053 3.8775 4.1536 1.0099 1.0083 1.0283 1.0155 1.0012 1.0087 0.9960 0.9901
dispcorr: -0.007570495 hartree
energy: -891.616895486762
dipole: 2.99672 -2.58652 0.41020 -4.90499 4.27916 -0.62583 -0.59169 0.66708 0.07539
magnitude: 0.75207 au
magnitude: 1.91162 debye
