program: Orca
programVersion: 4.2.1
elementType: Cl Cl Cl O O O N C C C C C C C H H H H
charge: 0
multiplicity: 1
keywords: wb97x-d3
keywords: def2-TZVPP
keywords: def2/J RIJCOSX GRIDX6 NOFINALGRIDX
keywords: grid4 nofinalgrid
keywords: scfconv7
keywords: smallprint printgap noloewdin
keywords: NOSOSCF
formula: C7H4Cl3NO3
InChI: InChI=1/C7H4Cl3NO3/c8-3-1-4(9)7(11-6(3)10)14-2-5(12)13/h1,12H,2H2
18 atoms
Cl -0.593257 -3.269453 0.016984
Cl 3.641594 0.049429 0.258045
Cl 1.64668 2.433675 -0.370448
O  -2.004503 -0.779786 -0.540002
O  -2.586878 0.750456 1.529734
O  -3.508993 2.354382 0.271108
N  -0.201722 0.618921 -0.427995
C  -0.704652 -0.588249 -0.349043
C  0.095531 -1.704848 -0.078468
C  -2.797115 0.353879 -0.801499
C  1.443572 -1.50112 0.109079
C  1.965888 -0.215207 0.024695
C  1.085201 0.818953 -0.251048
C  -2.993336 1.279983 0.381465
H  -2.409049 0.947868 -1.631442
H  -3.774348 -0.034017 -1.093423
H  2.095453 -2.336826 0.322091
H  -2.742872 1.39284 2.235004
totalener: -1930.27580136 hartree
nucrepener: 1215.27057089 hartree
electener: -3145.54637226 hartree
oneelecener: -5073.49043194 hartree
twoeener: 1927.94405968 hartree
kineticenergy: 1926.22763745 hartree
xcener: -113.399750385617 hartree
chargesum: -0.0000000
charge: -0.038300 -0.038272 -0.031078 -0.263498 -0.252780 -0.332147 -0.307044 0.429519 -0.095857 0.028810 -0.040757 -0.064522 0.126264 0.313370 0.113992 0.124776 0.120888 0.206636
qa: -0.0383 -0.0383 -0.0311 -0.2635 -0.2528 -0.3321 -0.3070 0.4295 -0.0959 0.0288 -0.0408 -0.0645 0.1263 0.3134 0.1140 0.1248 0.1209 0.2066
va: 1.2739 1.2751 1.2908 2.1545 2.2034 2.1720 2.9989 3.9252 4.0252 3.8494 3.9648 4.0322 4.2462 4.2475 1.0225 0.9966 1.0199 1.0407
dispcorr: -0.008073010 hartree
energy: -1930.283874374462
dipole: -12.82738 12.86302 0.03564 1.06432 -1.78018 -0.71586 -0.01388 0.25254 0.23866
magnitude: 0.75544 au
magnitude: 1.92017 debye
