program: Orca
programVersion: 4.2.1
elementType: Cl O O O C C C C C C C C C C H H H H H H H H H H H
charge: 0
multiplicity: 1
keywords: wb97x-d3
keywords: def2-TZVPP
keywords: def2/J RIJCOSX GRIDX6 NOFINALGRIDX
keywords: grid4 nofinalgrid
keywords: scfconv7
keywords: smallprint printgap noloewdin
keywords: NOSOSCF
formula: C10H11ClO3
InChI: InChI=1/C10H11ClO3/c1-6-5-8(11)3-4-9(6)14-7(2)10(12)13/h3-5,7,12H,1-2H3
25 atoms
Cl -4.15462 -0.699062 -0.08754
O  1.449143 0.975689 -0.258462
O  3.422323 -1.946577 0.057019
O  2.323183 -0.786282 1.623216
C  2.498093 0.108605 -0.609389
C  0.176774 0.516667 -0.237765
C  -0.786022 1.442453 0.189905
C  -0.20015 -0.763679 -0.621115
C  3.75184 0.952532 -0.776929
C  -2.113791 1.045717 0.228663
C  -0.383084 2.82791 0.593387
C  -1.535468 -1.144219 -0.578925
C  -2.483324 -0.23705 -0.152241
C  2.714662 -0.916084 0.494468
H  2.290564 -0.404861 -1.554665
H  4.014759 1.464451 0.148832
H  3.594869 1.69768 -1.555935
H  4.592644 0.329676 -1.077526
H  0.519315 -1.495067 -0.96436
H  -2.865952 1.749842 0.561683
H  0.334675 2.818757 1.415481
H  0.08331 3.369192 -0.232243
H  -1.248961 3.403625 0.916512
H  -1.815377 -2.143914 -0.880736
H  3.603901 -2.565365 0.781555
elementType: Cl O C H
totalener: -1073.67045051 hartree
nucrepener: 982.01772463 hartree
electener: -2055.68817514 hartree
oneelecener: -3421.22009047 hartree
twoeener: 1365.53191533 hartree
cpcmener: -0.02433161 hartree
kineticenergy: 1070.38234482 hartree
xcener: -79.215628254734 hartree
chargesum: -0.0000000
charge: -0.109721 -0.303404 -0.291759 -0.409152 0.127754 0.308819 -0.148768 -0.192512 -0.273008 -0.105814 -0.223115 -0.197867 0.085975 0.354542 0.113985 0.107227 0.104898 0.103468 0.130784 0.119422 0.101104 0.100421 0.093569 0.142305 0.260848
qa: -0.1097 -0.3034 -0.2918 -0.4092 0.1278 0.3088 -0.1488 -0.1925 -0.2730 -0.1058 -0.2231 -0.1979 0.0860 0.3545 0.1140 0.1072 0.1049 0.1035 0.1308 0.1194 0.1011 0.1004 0.0936 0.1423 0.2608
va: 1.1942 2.1086 2.2046 2.0838 3.8131 3.7543 3.8621 3.8863 3.9519 3.9641 3.9190 4.0413 3.8192 4.1838 1.0036 1.0038 1.0054 1.0120 1.0157 1.0155 0.9989 0.9966 1.0056 1.0068 0.9924
dispcorr: -0.010461179 hartree
energy: -1073.680911689684
dipole: 17.94636 -16.09883 1.84753 8.56780 -8.86486 -0.29706 -2.13206 1.19121 -0.94085
magnitude: 2.09447 au
magnitude: 5.32373 debye
