program: Orca
programVersion: 4.2.1
elementType: Cl O O O C C C C C C C C C C C H H H H H H H H H H H H H
charge: 0
multiplicity: 1
keywords: wb97x-d3
keywords: def2-TZVPP
keywords: def2/J RIJCOSX GRIDX6 NOFINALGRIDX
keywords: grid4 nofinalgrid
keywords: scfconv7
keywords: smallprint printgap noloewdin
keywords: NOSOSCF
formula: C11H13ClO3
InChI: InChI=1/C11H13ClO3/c1-8-7-9(12)4-5-10(8)15-6-2-3-11(13)14/h4-5,7,13H,2-3,6H2,1H3
28 atoms
Cl -4.987101 -0.43118 0.19469
O  0.746107 0.619336 0.69947
O  5.362022 -1.186245 -1.049716
O  3.599631 -1.088061 -2.411579
C  3.027947 0.792795 0.106456
C  1.632202 0.494821 -0.404076
C  4.084926 0.798284 -1.004399
C  -0.566361 0.36584 0.514625
C  -1.372313 0.457334 1.66094
C  -1.127224 0.03308 -0.712849
C  -2.730065 0.208699 1.537451
C  -0.773177 0.813524 2.986653
C  -2.490617 -0.214078 -0.818653
C  4.307812 -0.571584 -1.577585
C  -3.282166 -0.124668 0.307863
H  3.303075 0.076603 0.883883
H  3.033841 1.782635 0.565898
H  1.566028 -0.51404 -0.821293
H  1.359532 1.204067 -1.193822
H  5.016383 1.190938 -0.599291
H  3.768243 1.45978 -1.812303
H  -0.523464 -0.038632 -1.606698
H  -3.360584 0.275217 2.414743
H  -1.537501 0.837099 3.761275
H  -0.013348 0.092749 3.292197
H  -0.294067 1.793292 2.963697
H  -2.914046 -0.472796 -1.779166
H  5.447927 -2.07686 -1.423961
elementType: Cl O C H
totalener: -1112.98401515 hartree
nucrepener: 1034.46218722 hartree
electener: -2147.44620238 hartree
oneelecener: -3577.95534920 hartree
twoeener: 1430.50914683 hartree
cpcmener: -0.02824141 hartree
kineticenergy: 1109.47571026 hartree
xcener: -83.391669162204 hartree
chargesum: -0.0000000
charge: -0.114050 -0.329781 -0.303883 -0.475271 -0.111911 0.018653 -0.133124 0.341275 -0.162995 -0.232802 -0.105153 -0.226646 -0.198274 0.406242 0.081140 0.085251 0.088454 0.092737 0.102829 0.105354 0.100449 0.143864 0.121502 0.095006 0.100667 0.100079 0.145571 0.264816
qa: -0.1140 -0.3298 -0.3039 -0.4753 -0.1119 0.0187 -0.1331 0.3413 -0.1630 -0.2328 -0.1052 -0.2266 -0.1983 0.4062 0.0811 0.0853 0.0885 0.0927 0.1028 0.1054 0.1004 0.1439 0.1215 0.0950 0.1007 0.1001 0.1456 0.2648
va: 1.1907 2.0831 2.1799 2.0050 3.9197 3.8422 3.8714 3.7570 3.8570 3.8925 3.9494 3.9196 4.0344 4.1760 3.8072 1.0155 1.0130 1.0039 0.9844 1.0224 1.0179 1.0075 1.0151 1.0056 0.9972 0.9974 1.0053 0.9865
dispcorr: -0.010826527 hartree
energy: -1112.994841677717
dipole: 20.67498 -18.56215 2.11283 5.79018 -5.32568 0.46450 4.12331 -3.74798 0.37532
magnitude: 2.19560 au
magnitude: 5.58078 debye
