program: Orca
programVersion: 4.2.1
elementType: Cl O O O C C C C C C C C C C C H H H H H H H H H H H H H
charge: 0
multiplicity: 1
keywords: wb97x-d3
keywords: def2-TZVPP
keywords: def2/J RIJCOSX GRIDX6 NOFINALGRIDX
keywords: grid4 nofinalgrid
keywords: scfconv7
keywords: smallprint printgap noloewdin
keywords: NOSOSCF
formula: C11H13ClO3
InChI: InChI=1/C11H13ClO3/c1-8-7-9(12)4-5-10(8)15-6-2-3-11(13)14/h4-5,7,13H,2-3,6H2,1H3
28 atoms
Cl -4.493331 0.552832 -0.134384
O  0.967998 -0.913332 1.378226
O  2.681037 1.187811 -2.448703
O  4.812833 0.703561 -2.009899
C  2.487048 0.793532 0.489479
C  1.970214 0.040779 1.701388
C  3.091944 -0.146819 -0.556158
C  -0.271842 -0.499679 1.034048
C  -1.112761 -1.490648 0.504315
C  -0.73832 0.800042 1.196554
C  -2.409846 -1.145206 0.155636
C  -0.614622 -2.890765 0.318305
C  -2.039322 1.130432 0.839429
C  3.639934 0.606911 -1.731403
C  -2.866441 0.154865 0.320692
H  3.249713 1.489191 0.847127
H  1.696378 1.401445 0.046218
H  1.61842 0.738484 2.46665
H  2.775306 -0.540758 2.151132
H  2.334889 -0.848495 -0.914751
H  3.900709 -0.728207 -0.113916
H  -0.112478 1.580339 1.606594
H  -3.066106 -1.902543 -0.253728
H  -0.296412 -3.337993 1.261187
H  -1.393662 -3.524755 -0.101506
H  0.241776 -2.927294 -0.35758
H  -2.388004 2.14536 0.971335
H  3.070605 1.682161 -3.186171
elementType: Cl O C H
totalener: -1112.98298314 hartree
nucrepener: 1062.19381789 hartree
electener: -2175.17680104 hartree
oneelecener: -3633.06662569 hartree
twoeener: 1457.88982465 hartree
cpcmener: -0.02998617 hartree
kineticenergy: 1109.48010421 hartree
xcener: -83.394226693447 hartree
chargesum: 0.0000000
charge: -0.113233 -0.340980 -0.303575 -0.475857 -0.169850 0.005940 -0.076036 0.295680 -0.126880 -0.225805 -0.115233 -0.219477 -0.189544 0.391131 0.081773 0.104525 0.096812 0.112538 0.113640 0.100405 0.084618 0.147074 0.121635 0.099895 0.094970 0.099826 0.145333 0.260675
qa: -0.1132 -0.3410 -0.3036 -0.4759 -0.1699 0.0059 -0.0760 0.2957 -0.1269 -0.2258 -0.1152 -0.2195 -0.1895 0.3911 0.0818 0.1045 0.0968 0.1125 0.1136 0.1004 0.0846 0.1471 0.1216 0.0999 0.0950 0.0998 0.1453 0.2607
va: 1.1912 2.0611 2.1648 2.0076 3.8386 3.8786 3.7899 3.7729 3.8347 3.8768 3.9663 3.9202 4.0143 4.2086 3.8039 1.0174 1.0206 0.9944 0.9939 1.0289 1.0290 1.0018 1.0155 0.9968 1.0056 0.9970 1.0053 0.9907
dispcorr: -0.011800106 hartree
energy: -1112.994783249829
dipole: 16.99918 -16.59870 0.40048 -5.14110 5.43005 0.28895 4.20177 -3.66773 0.53404
magnitude: 0.72737 au
magnitude: 1.84883 debye
