program: Orca
programVersion: 4.2.1
elementType: Cl O O O C C C C C C C C C C C H H H H H H H H H H H H H
charge: 0
multiplicity: 1
keywords: wb97x-d3
keywords: def2-TZVPP
keywords: def2/J RIJCOSX GRIDX6 NOFINALGRIDX
keywords: grid4 nofinalgrid
keywords: scfconv7
keywords: smallprint printgap noloewdin
keywords: NOSOSCF
formula: C11H13ClO3
InChI: InChI=1/C11H13ClO3/c1-8-7-9(12)4-5-10(8)15-6-2-3-11(13)14/h4-5,7,13H,2-3,6H2,1H3
28 atoms
Cl -4.810448 -0.055697 0.26899
O  0.969484 -0.893001 0.687719
O  3.999738 2.269397 -0.314722
O  3.356459 0.956941 -1.995037
C  3.115837 -1.326139 -0.274569
C  1.621901 -1.307497 -0.512719
C  3.713893 -0.006138 0.185395
C  -0.372133 -0.692031 0.568426
C  -0.85964 0.578163 0.246868
C  -1.244094 -1.748899 0.794554
C  -2.237798 0.752162 0.163178
C  0.065979 1.731025 0.001513
C  -2.615319 -1.567591 0.706953
C  3.6551 1.095054 -0.833519
C  -3.097725 -0.310985 0.385046
H  3.594314 -1.658089 -1.197914
H  3.346255 -2.08401 0.477551
H  1.285007 -2.312137 -0.79249
H  1.359122 -0.639338 -1.33781
H  4.770689 -0.153233 0.431948
H  3.251827 0.33658 1.113663
H  -0.849097 -2.72286 1.055495
H  -2.636654 1.729218 -0.078089
H  0.503249 1.688115 -0.998708
H  -0.467103 2.678439 0.075962
H  0.885724 1.755614 0.718979
H  -3.287724 -2.394666 0.888561
H  3.979901 2.952811 -1.001952
elementType: Cl O C H
totalener: -1112.98790463 hartree
nucrepener: 1072.04823997 hartree
electener: -2185.03614460 hartree
oneelecener: -3653.25614479 hartree
twoeener: 1468.22000020 hartree
cpcmener: -0.02182308 hartree
kineticenergy: 1109.49039462 hartree
xcener: -83.390743362193 hartree
chargesum: -0.0000000
charge: -0.105128 -0.370026 -0.302584 -0.441279 -0.112457 -0.017089 -0.140864 0.143156 -0.000742 -0.147186 -0.182720 -0.224899 -0.182779 0.383855 0.119770 0.078363 0.085862 0.111756 0.103108 0.124545 0.102396 0.148747 0.122819 0.098304 0.104662 0.103216 0.143090 0.254105
qa: -0.1051 -0.3700 -0.3026 -0.4413 -0.1125 -0.0171 -0.1409 0.1432 -0.0007 -0.1472 -0.1827 -0.2249 -0.1828 0.3839 0.1198 0.0784 0.0859 0.1118 0.1031 0.1245 0.1024 0.1487 0.1228 0.0983 0.1047 0.1032 0.1431 0.2541
va: 1.1984 1.9712 2.1783 2.0409 3.9093 3.8069 3.8185 3.8694 3.6939 3.9635 4.0203 3.8884 4.0000 4.2160 3.8008 1.0236 1.0168 0.9992 0.9981 1.0128 1.0256 0.9994 1.0204 1.0017 1.0092 1.0040 1.0042 0.9970
dispcorr: -0.012923840 hartree
energy: -1113.000828467310
dipole: 21.36672 -20.00911 1.35762 -0.70441 0.77249 0.06808 -0.99592 1.22631 0.23039
magnitude: 1.37871 au
magnitude: 3.50440 debye
