program: Orca
programVersion: 4.2.1
elementType: Cl O O O C C C C C C C C C C C H H H H H H H H H H H H H
charge: 0
multiplicity: 1
keywords: wb97x-d3
keywords: def2-TZVPP
keywords: def2/J RIJCOSX GRIDX6 NOFINALGRIDX
keywords: grid4 nofinalgrid
keywords: scfconv7
keywords: smallprint printgap noloewdin
keywords: NOSOSCF
formula: C11H13ClO3
InChI: InChI=1/C11H13ClO3/c1-8-7-9(12)4-5-10(8)15-6-2-3-11(13)14/h4-5,7,13H,2-3,6H2,1H3
28 atoms
Cl -5.149792 -0.991205 0.969771
O  0.439399 0.47227 0.083808
O  5.133073 1.0629 -2.198815
O  6.029823 0.039296 -0.433836
C  2.707366 0.331545 -0.546089
C  1.394334 -0.418296 -0.465387
C  3.806482 -0.557888 -1.133129
C  -0.831488 0.066138 0.260009
C  -1.698195 1.024765 0.809541
C  -1.29852 -1.201393 -0.064848
C  -3.022737 0.676591 1.019053
C  -1.191074 2.390493 1.157429
C  -2.631144 -1.533463 0.151928
C  5.110703 0.183937 -1.201891
C  -3.483282 -0.592577 0.692365
H  2.997308 0.663935 0.45372
H  2.574534 1.222224 -1.163715
H  1.497655 -1.308558 0.16568
H  1.083065 -0.748762 -1.463229
H  3.522455 -0.889303 -2.134716
H  3.94737 -1.443834 -0.5138
H  -0.64618 -1.952327 -0.489519
H  -3.701027 1.406763 1.442249
H  -0.389126 2.348357 1.89693
H  -0.79081 2.908223 0.283622
H  -1.988001 3.00761 1.570106
H  -2.984823 -2.522664 -0.105414
H  5.968823 1.553901 -2.191819
elementType: Cl O C H
totalener: -1112.99137384 hartree
nucrepener: 1016.66678112 hartree
electener: -2129.65815496 hartree
oneelecener: -3541.91845486 hartree
twoeener: 1412.26029990 hartree
cpcmener: -0.02503903 hartree
kineticenergy: 1109.48557503 hartree
xcener: -83.391740423645 hartree
chargesum: 0.0000000
charge: -0.111821 -0.315077 -0.295724 -0.444929 -0.136219 0.015262 -0.091875 0.340152 -0.163815 -0.231240 -0.098554 -0.225256 -0.194006 0.363736 0.076626 0.089809 0.087065 0.099568 0.097551 0.100835 0.087919 0.141300 0.119483 0.100373 0.100060 0.093474 0.142535 0.252767
qa: -0.1118 -0.3151 -0.2957 -0.4449 -0.1362 0.0153 -0.0919 0.3402 -0.1638 -0.2312 -0.0986 -0.2253 -0.1940 0.3637 0.0766 0.0898 0.0871 0.0996 0.0976 0.1008 0.0879 0.1413 0.1195 0.1004 0.1001 0.0935 0.1425 0.2528
va: 1.1928 2.0940 2.1714 2.0446 3.9271 3.8497 3.8222 3.7585 3.8578 3.9014 3.9502 3.9203 4.0389 4.2345 3.8218 1.0157 1.0235 0.9867 0.9874 1.0183 1.0272 1.0083 1.0155 0.9974 0.9974 1.0059 1.0063 0.9974
dispcorr: -0.010454143 hartree
energy: -1113.001827983179
dipole: 17.46223 -16.73032 0.73191 5.39537 -5.20855 0.18683 -3.42582 2.38599 -1.03983
magnitude: 1.28524 au
magnitude: 3.26682 debye
