program: Orca
programVersion: 4.2.1
elementType: Cl O O O C C C C C C C C C C C H H H H H H H H H H H H H
charge: 0
multiplicity: 1
keywords: wb97x-d3
keywords: def2-TZVPP
keywords: def2/J RIJCOSX GRIDX6 NOFINALGRIDX
keywords: grid4 nofinalgrid
keywords: scfconv7
keywords: smallprint printgap noloewdin
keywords: NOSOSCF
formula: C11H13ClO3
InChI: InChI=1/C11H13ClO3/c1-8-7-9(12)4-5-10(8)15-6-2-3-11(13)14/h4-5,7,13H,2-3,6H2,1H3
28 atoms
Cl -4.972084 -0.670207 0.405184
O  0.690982 0.778342 0.568543
O  5.166981 -0.786591 -2.501948
O  4.04927 -1.645605 -0.776649
C  2.971679 0.912637 -0.048026
C  1.595519 0.435816 -0.469863
C  4.012561 0.738379 -1.14211
C  -0.601665 0.417578 0.463973
C  -1.425471 0.796572 1.536394
C  -1.130822 -0.282742 -0.613611
C  -2.766835 0.45122 1.4958
C  -0.859095 1.560138 2.69421
C  -2.478655 -0.621421 -0.637796
C  4.384127 -0.689086 -1.431397
C  -3.287109 -0.253195 0.417803
H  3.28512 0.393047 0.860035
H  2.916232 1.975643 0.196386
H  1.59064 -0.645624 -0.634584
H  1.297103 0.920268 -1.407224
H  4.933501 1.256417 -0.856715
H  3.690002 1.21561 -2.07168
H  -0.514681 -0.579341 -1.451316
H  -3.411574 0.737141 2.31742
H  -1.627493 1.763061 3.438605
H  -0.05611 1.010967 3.189355
H  -0.442314 2.519284 2.380579
H  -2.87771 -1.168618 -1.48115
H  5.411474 -1.712737 -2.649835
elementType: Cl O C H
totalener: -1112.99271428 hartree
nucrepener: 1032.45569275 hartree
electener: -2145.44840703 hartree
oneelecener: -3573.99795078 hartree
twoeener: 1428.54954374 hartree
cpcmener: -0.02413610 hartree
kineticenergy: 1109.48010903 hartree
xcener: -83.392045211042 hartree
chargesum: -0.0000000
charge: -0.112485 -0.318641 -0.303763 -0.444908 -0.107443 0.008275 -0.158628 0.341203 -0.162809 -0.228749 -0.099805 -0.226632 -0.196165 0.394810 0.077798 0.077386 0.085337 0.099865 0.099274 0.124877 0.102960 0.139986 0.119252 0.093453 0.099399 0.100532 0.142081 0.253538
qa: -0.1125 -0.3186 -0.3038 -0.4449 -0.1074 0.0083 -0.1586 0.3412 -0.1628 -0.2287 -0.0998 -0.2266 -0.1962 0.3948 0.0778 0.0774 0.0853 0.0999 0.0993 0.1249 0.1030 0.1400 0.1193 0.0935 0.0994 0.1005 0.1421 0.2535
va: 1.1924 2.0902 2.1809 2.0386 3.8878 3.8247 3.8638 3.7587 3.8559 3.8953 3.9499 3.9210 4.0404 4.2041 3.8205 1.0248 1.0179 1.0009 0.9865 1.0111 1.0177 1.0086 1.0155 1.0059 0.9977 0.9970 1.0065 0.9971
dispcorr: -0.010704743 hartree
energy: -1113.003419027467
dipole: 20.06461 -18.21288 1.85173 8.12538 -7.29521 0.83017 1.12993 -2.09581 -0.96588
magnitude: 2.24745 au
magnitude: 5.71255 debye
