program: Orca
programVersion: 4.2.1
elementType: Cl O O O C C C C C C C C C C C H H H H H H H H H H H H H
charge: 0
multiplicity: 1
keywords: wb97x-d3
keywords: def2-TZVPP
keywords: def2/J RIJCOSX GRIDX6 NOFINALGRIDX
keywords: grid4 nofinalgrid
keywords: scfconv7
keywords: smallprint printgap noloewdin
keywords: NOSOSCF
formula: C11H13ClO3
InChI: InChI=1/C11H13ClO3/c1-8-7-9(12)4-5-10(8)15-6-2-3-11(13)14/h4-5,7,13H,2-3,6H2,1H3
28 atoms
Cl -5.109412 -0.59642 0.763009
O  0.692989 -0.102349 0.253914
O  4.80001 1.447639 -2.364308
O  5.447889 0.618412 -0.400364
C  2.975474 -0.698099 0.028171
C  1.556283 -1.217305 0.101808
C  3.211103 0.187778 -1.184477
C  -0.633886 -0.290497 0.362004
C  -1.39802 0.877338 0.521584
C  -1.251926 -1.534776 0.328096
C  -2.772932 0.758376 0.642816
C  -0.731655 2.218527 0.554421
C  -2.633007 -1.635704 0.450638
C  4.60018 0.752338 -1.248312
C  -3.38368 -0.488647 0.606813
H  3.63738 -1.5660 -0.00745
H  3.211009 -0.162969 0.950641
H  1.455019 -1.897897 0.95393
H  1.302154 -1.7787 -0.805198
H  2.514184 1.031121 -1.19752
H  3.020869 -0.365115 -2.109491
H  -0.680438 -2.445025 0.207499
H  -3.371848 1.65162 0.768407
H  -1.455591 3.00747 0.753242
H  0.037067 2.272006 1.32697
H  -0.24455 2.449606 -0.395191
H  -3.102514 -2.609619 0.422968
H  5.697426 1.81361 -2.370197
elementType: Cl O C H
totalener: -1112.99325319 hartree
nucrepener: 1032.50113159 hartree
electener: -2145.49438478 hartree
oneelecener: -3573.79381068 hartree
twoeener: 1428.29942589 hartree
cpcmener: -0.02387310 hartree
kineticenergy: 1109.48784708 hartree
xcener: -83.393357857675 hartree
chargesum: 0.0000000
charge: -0.112595 -0.316890 -0.305103 -0.447657 -0.110556 -0.014023 -0.124689 0.320626 -0.135822 -0.221736 -0.114459 -0.223926 -0.197741 0.394875 0.083480 0.081360 0.072079 0.116043 0.102800 0.104369 0.100447 0.141250 0.119516 0.095422 0.098423 0.100123 0.141709 0.252677
qa: -0.1126 -0.3169 -0.3051 -0.4477 -0.1106 -0.0140 -0.1247 0.3206 -0.1358 -0.2217 -0.1145 -0.2239 -0.1977 0.3949 0.0835 0.0814 0.0721 0.1160 0.1028 0.1044 0.1004 0.1412 0.1195 0.0954 0.0984 0.1001 0.1417 0.2527
va: 1.1919 2.0904 2.1796 2.0412 3.9500 3.8913 3.8050 3.7765 3.8316 3.8972 3.9697 3.9151 4.0437 4.2283 3.8146 1.0187 1.0257 0.9910 0.9866 1.0274 1.0185 1.0068 1.0161 1.0063 0.9989 0.9963 1.0063 0.9981
dispcorr: -0.010871789 hartree
energy: -1113.004124981691
dipole: 18.27454 -17.40387 0.87067 2.19917 -2.39406 -0.19489 -2.43853 1.57055 -0.86798
magnitude: 1.24477 au
magnitude: 3.16394 debye
