program: Orca
programVersion: 4.2.1
elementType: Cl O O O C C C C C C C C C C C H H H H H H H H H H H H H
charge: 0
multiplicity: 1
keywords: wb97x-d3
keywords: def2-TZVPP
keywords: def2/J RIJCOSX GRIDX6 NOFINALGRIDX
keywords: grid4 nofinalgrid
keywords: scfconv7
keywords: smallprint printgap noloewdin
keywords: NOSOSCF
formula: C11H13ClO3
InChI: InChI=1/C11H13ClO3/c1-8-7-9(12)4-5-10(8)15-6-2-3-11(13)14/h4-5,7,13H,2-3,6H2,1H3
28 atoms
Cl -4.712956 -0.152969 0.215607
O  1.126972 -0.444421 0.32365
O  3.63847 1.508534 0.298785
O  2.831978 1.500286 -1.780375
C  3.306066 -1.380513 0.263772
C  1.819723 -1.66528 0.217327
C  3.802974 -0.517176 -0.895062
C  -0.222671 -0.445278 0.285463
C  -0.836849 0.810111 0.399029
C  -0.993729 -1.592222 0.151218
C  -2.219615 0.872515 0.376786
C  -0.010789 2.053911 0.527703
C  -2.380202 -1.508888 0.126857
C  3.347153 0.918977 -0.866576
C  -2.987149 -0.276198 0.24072
H  3.820793 -2.343169 0.222098
H  3.57211 -0.931205 1.221974
H  1.54576 -2.338896 1.038799
H  1.566145 -2.171979 -0.723234
H  3.498374 -0.943249 -1.851426
H  4.897056 -0.511414 -0.88397
H  -0.538182 -2.56859 0.062101
H  -2.707669 1.834482 0.464971
H  0.694005 1.983007 1.357251
H  0.565034 2.237163 -0.380608
H  -0.645372 2.921643 0.700599
H  -2.973298 -2.406258 0.0197
H  3.325291 2.421023 0.259822
totalener: -1112.97108204 hartree
nucrepener: 1087.02234663 hartree
electener: -2199.99342867 hartree
oneelecener: -3682.72264849 hartree
twoeener: 1482.72921982 hartree
kineticenergy: 1109.52710075 hartree
xcener: -83.396526134568 hartree
chargesum: 0.0000000
charge: -0.092534 -0.293021 -0.269776 -0.340814 -0.140903 -0.014639 -0.104676 0.320491 -0.091001 -0.187316 -0.108388 -0.245399 -0.179903 0.313043 0.084490 0.079283 0.087871 0.096867 0.084948 0.086069 0.097788 0.110466 0.098774 0.095750 0.104787 0.086108 0.116302 0.205334
qa: -0.0925 -0.2930 -0.2698 -0.3408 -0.1409 -0.0146 -0.1047 0.3205 -0.0910 -0.1873 -0.1084 -0.2454 -0.1799 0.3130 0.0845 0.0793 0.0879 0.0969 0.0849 0.0861 0.0978 0.1105 0.0988 0.0957 0.1048 0.0861 0.1163 0.2053
va: 1.2126 2.1077 2.1718 2.1506 3.9425 3.9136 3.8158 3.8132 3.8323 3.9233 4.0063 3.9021 4.0988 4.2851 3.9222 1.0103 1.0244 0.9896 0.9860 1.0275 1.0115 1.0150 1.0216 0.9995 1.0110 1.0157 1.0142 1.0412
dispcorr: -0.012698236 hartree
energy: -1112.983780273484
dipole: 21.89991 -20.57399 1.32592 -2.39878 1.71619 -0.68259 1.08097 -0.51051 0.57045
magnitude: 1.59669 au
magnitude: 4.05846 debye
