program: Orca
programVersion: 4.2.1
elementType: Cl O O O C C C C C C C C C C C H H H H H H H H H H H H H
charge: 0
multiplicity: 1
keywords: wb97x-d3
keywords: def2-TZVPP
keywords: def2/J RIJCOSX GRIDX6 NOFINALGRIDX
keywords: grid4 nofinalgrid
keywords: scfconv7
keywords: smallprint printgap noloewdin
keywords: NOSOSCF
formula: C11H13ClO3
InChI: InChI=1/C11H13ClO3/c1-8-7-9(12)4-5-10(8)15-6-2-3-11(13)14/h4-5,7,13H,2-3,6H2,1H3
28 atoms
Cl -4.53312 -1.017184 1.378967
O  0.546268 0.670009 -0.984161
O  4.839859 1.149369 0.607608
O  4.607871 0.298403 -1.438751
C  2.223466 -1.096853 -0.746351
C  1.4242 -0.195197 -1.67662
C  3.046653 -0.339621 0.284652
C  -0.604425 0.201661 -0.45804
C  -1.316709 1.115762 0.332943
C  -1.108828 -1.076163 -0.667065
C  -2.522365 0.718191 0.886177
C  -0.777238 2.494593 0.565486
C  -2.319721 -1.457419 -0.104081
C  4.228005 0.386687 -0.302988
C  -3.022605 -0.558107 0.670194
H  2.876091 -1.717847 -1.363446
H  1.554719 -1.781632 -0.22034
H  0.885302 -0.793888 -2.418854
H  2.093534 0.460515 -2.231998
H  3.4320 -1.033112 1.038231
H  2.428769 0.370171 0.840024
H  -0.578962 -1.798496 -1.272165
H  -3.082016 1.415831 1.49573
H  0.20091 2.468382 1.048075
H  -0.653715 3.041277 -0.370004
H  -1.446813 3.070011 1.202635
H  -2.703612 -2.453475 -0.274784
H  5.59695 1.576773 0.185774
totalener: -1112.97170146 hartree
nucrepener: 1061.71532821 hartree
electener: -2174.68702967 hartree
oneelecener: -3632.00099480 hartree
twoeener: 1457.31396512 hartree
kineticenergy: 1109.52563031 hartree
xcener: -83.397252641989 hartree
chargesum: 0.0000000
charge: -0.092675 -0.301994 -0.268867 -0.354961 -0.146035 -0.035053 -0.139475 0.301567 -0.111428 -0.208013 -0.092852 -0.205075 -0.169021 0.337021 0.073549 0.090648 0.092786 0.093224 0.124863 0.105502 0.097521 0.114175 0.099006 0.090003 0.098884 0.082238 0.118450 0.206010
qa: -0.0927 -0.3020 -0.2689 -0.3550 -0.1460 -0.0351 -0.1395 0.3016 -0.1114 -0.2080 -0.0929 -0.2051 -0.1690 0.3370 0.0735 0.0906 0.0928 0.0932 0.1249 0.1055 0.0975 0.1142 0.0990 0.0900 0.0989 0.0822 0.1184 0.2060
va: 1.2126 2.0830 2.1964 2.1265 3.8649 3.8765 3.8220 3.8146 3.8558 3.9030 3.9847 3.9326 4.0711 4.2580 3.9262 1.0280 1.0112 0.9964 1.0102 1.0180 1.0310 1.0119 1.0196 0.9997 0.9983 1.0070 1.0137 1.0404
dispcorr: -0.011849836 hartree
energy: -1112.983551299056
dipole: 16.13854 -15.22416 0.91438 3.90389 -3.87188 0.03201 -4.21154 4.33506 0.12352
magnitude: 0.92324 au
magnitude: 2.34669 debye
