program: Orca
programVersion: 4.2.1
elementType: Cl O O O C C C C C C C C C H H H H H H H H H
charge: 0
multiplicity: 1
keywords: wb97x-d3
keywords: def2-TZVPP
keywords: def2/J RIJCOSX GRIDX6 NOFINALGRIDX
keywords: grid4 nofinalgrid
keywords: scfconv7
keywords: smallprint printgap noloewdin
keywords: NOSOSCF
formula: C9H9ClO3
InChI: InChI=1/C9H9ClO3/c1-6-4-7(10)2-3-8(6)13-5-9(11)12/h2-4,11H,5H2,1H3
22 atoms
Cl 4.318636 -0.254984 0.31198
O  -1.492701 0.242759 -0.115597
O  -4.594316 -1.413897 -0.179012
O  -4.070799 0.755982 -0.358426
C  0.620172 1.220044 -0.065867
C  -0.157722 0.053585 -0.010841
C  1.996911 1.099813 0.035506
C  0.44208 -1.189479 0.142167
C  -0.027706 2.560152 -0.229268
C  2.591235 -0.145901 0.188204
C  1.824595 -1.291573 0.242288
C  -2.330648 -0.881642 -0.075018
C  -3.748094 -0.394543 -0.219485
H  2.608926 1.991473 -0.006064
H  -0.142024 -2.09823 0.187711
H  -0.708463 2.781128 0.593889
H  0.721534 3.349045 -0.261379
H  -0.610663 2.61671 -1.149362
H  2.281088 -2.264215 0.360983
H  -2.113734 -1.58577 -0.887041
H  -2.237915 -1.43034 0.869392
H  -5.506496 -1.098848 -0.274742
elementType: Cl O C H
totalener: -1034.34371376 hartree
nucrepener: 840.84671246 hartree
electener: -1875.19042622 hartree
oneelecener: -3086.79672943 hartree
twoeener: 1211.60630321 hartree
cpcmener: -0.03069867 hartree
kineticenergy: 1031.26129725 hartree
xcener: -75.037714154545 hartree
chargesum: 0.0000000
charge: -0.111672 -0.301943 -0.301745 -0.447048 -0.144566 0.323780 -0.108752 -0.223900 -0.221089 0.085655 -0.198163 0.027042 0.381139 0.122555 0.141919 0.100598 0.095200 0.099407 0.145242 0.134476 0.133521 0.268342
qa: -0.1117 -0.3019 -0.3017 -0.4470 -0.1446 0.3238 -0.1088 -0.2239 -0.2211 0.0857 -0.1982 0.0270 0.3811 0.1226 0.1419 0.1006 0.0952 0.0994 0.1452 0.1345 0.1335 0.2683
va: 1.1927 2.0954 2.1858 2.0463 3.8311 3.7700 3.9568 3.8987 3.9197 3.8111 4.0376 3.8036 4.2668 1.0151 1.0096 0.9977 1.0057 0.9984 1.0055 0.9910 0.9915 0.9844
dispcorr: -0.007878217 hartree
energy: -1034.351591978217
dipole: -11.27965 10.00758 -1.27207 2.49383 -3.86263 -1.36881 -0.96475 1.01097 0.04622
magnitude: 1.86921 au
magnitude: 4.75115 debye
