program: Orca
programVersion: 4.2.1
elementType: Cl O O O C C C C C C C C C H H H H H H H H H
charge: 0
multiplicity: 1
keywords: wb97x-d3
keywords: def2-TZVPP
keywords: def2/J RIJCOSX GRIDX6 NOFINALGRIDX
keywords: grid4 nofinalgrid
keywords: scfconv7
keywords: smallprint printgap noloewdin
keywords: NOSOSCF
formula: C9H9ClO3
InChI: InChI=1/C9H9ClO3/c1-6-4-7(10)2-3-8(6)13-5-9(11)12/h2-4,11H,5H2,1H3
22 atoms
Cl 3.8247 -0.927759 0.27991
O  -1.588236 1.192313 -0.414014
O  -3.949019 -1.470188 -0.578775
O  -2.729499 -0.73585 1.151009
C  0.607281 1.450259 0.326392
C  -0.356323 0.637896 -0.287292
C  1.889484 0.947455 0.488545
C  -0.023425 -0.633398 -0.735783
C  0.25988 2.828665 0.79724
C  2.212288 -0.328415 0.049396
C  1.265592 -1.122015 -0.565518
C  -2.628427 0.423686 -0.954409
C  -3.087588 -0.652415 0.004617
H  2.640425 1.563911 0.965134
H  -0.740969 -1.275802 -1.227245
H  1.12098 3.301325 1.266339
H  -0.060068 3.467417 -0.027152
H  -0.550204 2.815388 1.527049
H  1.509317 -2.115582 -0.91426
H  -3.464275 1.107826 -1.119478
H  -2.376006 -0.005357 -1.929474
H  -4.268179 -2.135354 0.05128
elementType: Cl O C H
totalener: -1034.34380911 hartree
nucrepener: 863.18749994 hartree
electener: -1897.53130905 hartree
oneelecener: -3131.81878128 hartree
twoeener: 1234.28747224 hartree
cpcmener: -0.03063361 hartree
kineticenergy: 1031.26086259 hartree
xcener: -75.038542874967 hartree
chargesum: -0.0000000
charge: -0.111030 -0.319711 -0.302902 -0.441786 -0.124656 0.284399 -0.118610 -0.192221 -0.213280 0.086718 -0.193310 0.005759 0.381838 0.121868 0.139084 0.093415 0.101702 0.100778 0.146123 0.150162 0.132821 0.272840
qa: -0.1110 -0.3197 -0.3029 -0.4418 -0.1247 0.2844 -0.1186 -0.1922 -0.2133 0.0867 -0.1933 0.0058 0.3818 0.1219 0.1391 0.0934 0.1017 0.1008 0.1461 0.1502 0.1328 0.2728
va: 1.1929 2.0838 2.1884 2.0448 3.8409 3.7583 3.9762 3.8776 3.9111 3.8087 4.0292 3.8554 4.1686 1.0152 1.0095 1.0058 0.9966 0.9988 1.0055 0.9963 0.9980 0.9811
dispcorr: -0.008589407 hartree
energy: -1034.352398515877
dipole: -11.01818 9.25470 -1.76348 7.52670 -7.63558 -0.10888 -1.71210 0.52001 -1.19210
magnitude: 2.13139 au
magnitude: 5.41756 debye
