program: Orca
programVersion: 4.2.1
elementType: Cl O O O C C C C C C C C C H H H H H H H H H
charge: 0
multiplicity: 1
keywords: wb97x-d3
keywords: def2-TZVPP
keywords: def2/J RIJCOSX GRIDX6 NOFINALGRIDX
keywords: grid4 nofinalgrid
keywords: scfconv7
keywords: smallprint printgap noloewdin
keywords: NOSOSCF
formula: C9H9ClO3
InChI: InChI=1/C9H9ClO3/c1-6-4-7(10)2-3-8(6)13-5-9(11)12/h2-4,11H,5H2,1H3
22 atoms
Cl 4.173356 -0.396473 0.634293
O  -1.442743 0.332847 -0.820561
O  -4.572674 -1.163761 -0.222503
O  -3.653064 0.684421 0.641886
C  0.531501 1.171087 0.099349
C  -0.149465 0.102815 -0.498183
C  1.866617 0.995827 0.434402
C  0.502764 -1.094016 -0.762947
C  -0.172501 2.464925 0.370204
C  2.507651 -0.209501 0.185691
C  1.836578 -1.257454 -0.413744
C  -2.3631 -0.723747 -0.825545
C  -3.588081 -0.292897 -0.05329
H  2.404947 1.808288 0.905799
H  -0.006573 -1.912622 -1.25528
H  -1.092641 2.311054 0.935489
H  0.463696 3.142399 0.937857
H  -0.450093 2.972726 -0.555771
H  2.334887 -2.194781 -0.619959
H  -2.637221 -1.000583 -1.847825
H  -1.975771 -1.626483 -0.339513
H  -5.339859 -0.9129 0.314672
elementType: Cl O C H
totalener: -1034.34516223 hartree
nucrepener: 846.93263230 hartree
electener: -1881.27779453 hartree
oneelecener: -3099.06333972 hartree
twoeener: 1217.78554518 hartree
cpcmener: -0.02398632 hartree
kineticenergy: 1031.27291115 hartree
xcener: -75.037916838733 hartree
chargesum: -0.0000000
charge: -0.108568 -0.319729 -0.300005 -0.417383 -0.085920 0.245452 -0.125972 -0.206386 -0.211664 0.087264 -0.178029 0.035720 0.374093 0.120501 0.146718 0.098284 0.093348 0.101472 0.143531 0.130958 0.114102 0.262216
qa: -0.1086 -0.3197 -0.3000 -0.4174 -0.0859 0.2455 -0.1260 -0.2064 -0.2117 0.0873 -0.1780 0.0357 0.3741 0.1205 0.1467 0.0983 0.0933 0.1015 0.1435 0.1310 0.1141 0.2622
va: 1.1954 2.0813 2.1816 2.0734 3.7920 3.8399 3.9760 3.9084 3.9116 3.8214 4.0013 3.8270 4.2294 1.0164 1.0001 1.0079 1.0067 0.9955 1.0052 0.9946 1.0017 0.9900
dispcorr: -0.008264014 hartree
energy: -1034.353426248961
dipole: -11.60376 10.21307 -1.39069 2.95340 -4.06944 -1.11605 -2.17884 1.62599 -0.55286
magnitude: 1.86688 au
magnitude: 4.74522 debye
