program: Orca
programVersion: 4.2.1
elementType: Cl O O O C C C C C C C C C H H H H H H H H H
charge: 0
multiplicity: 1
keywords: wb97x-d3
keywords: def2-TZVPP
keywords: def2/J RIJCOSX GRIDX6 NOFINALGRIDX
keywords: grid4 nofinalgrid
keywords: scfconv7
keywords: smallprint printgap noloewdin
keywords: NOSOSCF
formula: C9H9ClO3
InChI: InChI=1/C9H9ClO3/c1-6-4-7(10)2-3-8(6)13-5-9(11)12/h2-4,11H,5H2,1H3
22 atoms
Cl 3.843729 -0.910267 0.260076
O  -1.580485 1.178823 -0.409594
O  -3.972209 -1.449115 -0.580562
O  -2.755323 -0.729344 1.156477
C  0.610395 1.445818 0.327467
C  -0.350141 0.627973 -0.283725
C  1.896394 0.951279 0.483539
C  -0.012737 -0.642331 -0.731324
C  0.250394 2.820532 0.801507
C  2.226167 -0.322247 0.040851
C  1.280719 -1.121884 -0.568297
C  -2.619558 0.418361 -0.953931
C  -3.100901 -0.645227 0.008758
H  2.646674 1.571286 0.957908
H  -0.731016 -1.291283 -1.214325
H  1.107466 3.30549 1.266304
H  -0.083427 3.457782 -0.019634
H  -0.555818 2.798272 1.536951
H  1.52997 -2.114791 -0.91676
H  -3.447075 1.108667 -1.134873
H  -2.363899 -0.020829 -1.923489
H  -4.311573 -2.102963 0.050188
elementType: Cl O C H
totalener: -1034.34837351 hartree
nucrepener: 862.67901905 hartree
electener: -1897.02739256 hartree
oneelecener: -3130.69731833 hartree
twoeener: 1233.66992578 hartree
cpcmener: -0.02519362 hartree
kineticenergy: 1031.27174177 hartree
xcener: -75.038999432396 hartree
chargesum: -0.0000000
charge: -0.109382 -0.308560 -0.298365 -0.413252 -0.125904 0.291513 -0.115904 -0.191521 -0.213703 0.085689 -0.191759 -0.000516 0.362253 0.119728 0.133922 0.092156 0.100318 0.100986 0.142690 0.147304 0.128650 0.263656
qa: -0.1094 -0.3086 -0.2984 -0.4133 -0.1259 0.2915 -0.1159 -0.1915 -0.2137 0.0857 -0.1918 -0.0005 0.3623 0.1197 0.1339 0.0922 0.1003 0.1010 0.1427 0.1473 0.1286 0.2637
va: 1.1947 2.0959 2.1861 2.0787 3.8429 3.7630 3.9783 3.8827 3.9133 3.8207 4.0377 3.8609 4.1923 1.0155 1.0106 1.0059 0.9969 0.9987 1.0065 0.9972 0.9987 0.9894
dispcorr: -0.008574041 hartree
energy: -1034.356947546343
dipole: -11.08060 9.35784 -1.72276 7.47067 -7.54972 -0.07904 -1.65655 0.55315 -1.10339
magnitude: 2.04734 au
magnitude: 5.20393 debye
