program: Orca
programVersion: 4.2.1
elementType: Cl O O O C C C C C C C C C H H H H H H H H H
charge: 0
multiplicity: 1
keywords: wb97x-d3
keywords: def2-TZVPP
keywords: def2/J RIJCOSX GRIDX6 NOFINALGRIDX
keywords: grid4 nofinalgrid
keywords: scfconv7
keywords: smallprint printgap noloewdin
keywords: NOSOSCF
formula: C9H9ClO3
InChI: InChI=1/C9H9ClO3/c1-6-4-7(10)2-3-8(6)13-5-9(11)12/h2-4,11H,5H2,1H3
22 atoms
Cl 3.929892 -0.775758 -0.138051
O  -1.617917 0.818358 0.842139
O  -4.036754 -0.521804 -1.41745
O  -3.043196 -1.505771 0.327931
C  0.572098 1.378207 0.081174
C  -0.328912 0.436369 0.582681
C  1.885517 0.979926 -0.13692
C  0.079093 -0.856254 0.873763
C  0.147618 2.792304 -0.185453
C  2.28665 -0.315915 0.143526
C  1.393199 -1.238956 0.656977
C  -2.499878 0.785995 -0.23885
C  -3.19585 -0.554507 -0.379617
H  2.603675 1.692268 -0.521495
H  -0.6355 -1.559492 1.27733
H  1.008949 3.421187 -0.40357
H  -0.527446 2.866794 -1.040511
H  -0.371848 3.219813 0.671665
H  1.714133 -2.245643 0.885059
H  -3.263729 1.551762 -0.074091
H  -2.013896 1.027249 -1.192305
H  -4.480255 -1.377707 -1.4847
totalener: -1034.32630200 hartree
nucrepener: 858.64049277 hartree
electener: -1892.96679476 hartree
oneelecener: -3122.15427753 hartree
twoeener: 1229.18748277 hartree
kineticenergy: 1031.31509832 hartree
xcener: -75.037351749623 hartree
chargesum: 0.0000000
charge: -0.085127 -0.312687 -0.274189 -0.333263 -0.028499 0.133421 -0.150934 -0.118261 -0.205693 0.106375 -0.151111 0.011426 0.319712 0.102070 0.149756 0.087319 0.081472 0.112819 0.122148 0.126206 0.096787 0.210255
qa: -0.0851 -0.3127 -0.2742 -0.3333 -0.0285 0.1334 -0.1509 -0.1183 -0.2057 0.1064 -0.1511 0.0114 0.3197 0.1021 0.1498 0.0873 0.0815 0.1128 0.1221 0.1262 0.0968 0.2103
va: 1.2194 2.0392 2.1824 2.1466 3.7808 3.9128 4.0275 3.9645 3.9104 3.9114 4.0192 3.8673 4.2378 1.0245 1.0157 1.0091 0.9971 0.9994 1.0111 1.0001 1.0029 1.0385
dispcorr: -0.008829933 hartree
energy: -1034.335131929098
dipole: -10.93754 10.03090 -0.90664 8.99056 -8.39913 0.59142 -1.79947 1.03156 -0.76792
magnitude: 1.32721 au
magnitude: 3.37349 debye
