program: Orca
programVersion: 4.2.1
elementType: Cl O O O C C C C C C C C C H H H H H H H H H
charge: 0
multiplicity: 1
keywords: wb97x-d3
keywords: def2-TZVPP
keywords: def2/J RIJCOSX GRIDX6 NOFINALGRIDX
keywords: grid4 nofinalgrid
keywords: scfconv7
keywords: smallprint printgap noloewdin
keywords: NOSOSCF
formula: C9H9ClO3
InChI: InChI=1/C9H9ClO3/c1-6-4-7(10)2-3-8(6)13-5-9(11)12/h2-4,11H,5H2,1H3
22 atoms
Cl 3.85897 -0.890833 0.234109
O  -1.571726 1.17734 -0.433474
O  -3.974993 -1.446748 -0.577136
O  -2.820078 -0.674326 1.180592
C  0.611678 1.439254 0.324663
C  -0.343053 0.62207 -0.292792
C  1.898848 0.951407 0.475366
C  -0.001062 -0.646972 -0.736272
C  0.237357 2.804588 0.815526
C  2.240014 -0.316941 0.027334
C  1.294886 -1.119613 -0.57616
C  -2.606907 0.41634 -0.961303
C  -3.116125 -0.619042 0.025516
H  2.64778 1.570177 0.952277
H  -0.721377 -1.300372 -1.209563
H  1.088538 3.292452 1.2874
H  -0.105982 3.44547 0.002461
H  -0.569577 2.756065 1.547404
H  1.55404 -2.1105 -0.921419
H  -3.424624 1.110447 -1.173907
H  -2.349858 -0.058321 -1.915781
H  -4.318994 -2.067947 0.078671
totalener: -1034.32935683 hartree
nucrepener: 862.12715242 hartree
electener: -1896.45650924 hartree
oneelecener: -3129.08150194 hartree
twoeener: 1232.62499269 hartree
kineticenergy: 1031.31378110 hartree
xcener: -75.040365322785 hartree
chargesum: -0.0000000
charge: -0.091299 -0.283730 -0.272442 -0.306226 -0.116988 0.308156 -0.098607 -0.156464 -0.206355 0.079516 -0.173923 -0.016834 0.291099 0.098987 0.100478 0.079901 0.094221 0.104458 0.116565 0.126121 0.111423 0.211943
qa: -0.0913 -0.2837 -0.2724 -0.3062 -0.1170 0.3082 -0.0986 -0.1565 -0.2064 0.0795 -0.1739 -0.0168 0.2911 0.0990 0.1005 0.0799 0.0942 0.1045 0.1166 0.1261 0.1114 0.2119
va: 1.2135 2.1218 2.1799 2.1812 3.8803 3.7965 3.9965 3.9028 3.9218 3.9284 4.0917 3.8970 4.2281 1.0196 1.0188 1.0074 0.9992 0.9993 1.0146 1.0030 1.0009 1.0366
dispcorr: -0.008555997 hartree
energy: -1034.337912824203
dipole: -11.09480 9.83559 -1.25921 7.32261 -7.34583 -0.02322 -1.54026 0.84373 -0.69653
magnitude: 1.43920 au
magnitude: 3.65816 debye
