program: Orca
programVersion: 4.2.1
elementType: Cl Cl F O O O N N C C C C C C C C C C C C C H H H H H H H H H
charge: 0
multiplicity: 1
keywords: wb97x-d3
keywords: def2-TZVPP
keywords: def2/J RIJCOSX GRIDX6 NOFINALGRIDX
keywords: grid4 nofinalgrid
keywords: scfconv7
keywords: smallprint printgap noloewdin
keywords: NOSOSCF
formula: C13H9Cl2FN2O3
InChI: InChI=1/C13H9Cl2FN2O3/c1-21-12-6(14)3-2-5(10(12)16)8-4-7(17)9(15)11(18-8)13(19)20/h2-4,19H,17H2,1H3
30 atoms
Cl -4.965874 -0.485549 -0.336951
Cl 5.421745 0.189278 -0.815044
F  1.14047 -0.825588 1.588765
O  3.872503 -0.610633 1.500833
O  -2.304666 1.329894 2.548646
O  -4.16515 1.750435 1.392595
N  -1.151991 0.404282 0.373033
N  -3.300791 -1.8871 -2.335082
C  0.93215 -0.167916 -0.658251
C  -0.541929 -0.272316 -0.593704
C  1.718305 -0.424115 0.453791
C  -1.219923 -1.032854 -1.525726
C  1.575788 0.177959 -1.842971
C  -2.616965 -1.115921 -1.474718
C  3.106069 -0.323891 0.436748
C  -2.475115 0.360416 0.430486
C  2.953952 0.28274 -1.904005
C  -3.248522 -0.373709 -0.456848
C  3.706181 0.046143 -0.765308
C  -3.091419 1.216145 1.494856
C  3.665531 0.141424 2.695924
H  -0.680058 -1.587413 -2.282932
H  0.988704 0.38773 -2.727199
H  3.438399 0.5680 -2.827249
H  -2.824046 -2.295452 -3.120354
H  -4.302739 -1.838434 -2.39556
H  4.628441 0.19982 3.200628
H  2.954959 -0.347594 3.362294
H  3.323592 1.155937 2.484272
H  -2.718612 1.916121 3.200612
elementType: Cl F O N C H
totalener: -1856.36008098 hartree
nucrepener: 1896.01213518 hartree
electener: -3752.37221617 hartree
oneelecener: -6321.09321733 hartree
twoeener: 2568.72100116 hartree
cpcmener: -0.03445409 hartree
kineticenergy: 1851.38333366 hartree
xcener: -128.378196774819 hartree
chargesum: -0.0000000
charge: -0.072975 -0.077891 -0.206060 -0.342295 -0.268564 -0.406370 -0.357990 -0.235934 -0.097372 0.283325 0.314303 -0.176431 -0.161060 0.133048 0.068280 0.149356 -0.183080 -0.047851 0.061029 0.339629 -0.105276 0.134693 0.155706 0.140957 0.182617 0.173587 0.117698 0.113721 0.115523 0.255676
qa: -0.0730 -0.0779 -0.2061 -0.3423 -0.2686 -0.4064 -0.3580 -0.2359 -0.0974 0.2833 0.3143 -0.1764 -0.1611 0.1330 0.0683 0.1494 -0.1831 -0.0479 0.0610 0.3396 -0.1053 0.1347 0.1557 0.1410 0.1826 0.1736 0.1177 0.1137 0.1155 0.2557
va: 1.2645 1.2360 1.0948 2.0298 2.2148 2.0709 3.0429 3.2678 3.6667 3.7516 3.8736 3.9548 3.9331 4.0613 4.0002 3.8328 4.0506 3.9869 3.8579 4.3374 3.8335 1.0079 0.9968 1.0108 1.0067 1.0301 0.9938 0.9900 0.9893 0.9954
dispcorr: -0.013564943 hartree
energy: -1856.373645926268
dipole: 2.89250 -3.18763 -0.29513 -0.13574 -0.66527 -0.80101 -0.94134 -0.65802 -1.59936
magnitude: 1.81292 au
magnitude: 4.60808 debye
