program: Gaussian 09
title: 000059318
version: EM64L-G09RevD.01
frameworkgroup: C1[X(C21H24N2)]
method: RPBEPBE
basis: SDD
operation: Freq
keyword: #pfreq=noraman
keyword: PBEPBE/SDD
title: #p freq=noraman PBEPBE/SDD
converged: YES YES NO NO
title: Mulliken charges:
elementType: N N C C C C C C C C C C C C C C C C C C C C C H H H H H H H H H H H H H H H H H H H H H H H H
charge: -0.218327 -0.080894 -0.420206 0.327433 -0.552478 -0.360895 0.173311 0.470972 0.406902 -0.376329 -0.373385 -0.473762 -0.258247 -0.434455 -0.618186 -0.616812 -0.453877 -0.369372 -0.266599 -0.244955 -0.223178 -0.230987 -0.243118 0.260595 0.235549 0.194304 0.246082 0.180047 0.227306 0.243002 0.263447 0.237399 0.221496 0.235742 0.231428 0.184816 0.221039 0.223846 0.183371 0.231048 0.230050 0.254303 0.226133 0.226104 0.225657 0.226473 0.228204
chargesum: 0.00000
title: Mulliken charges with hydrogens summed into heavy atoms:
elementType: N N C C C C C C C C C C C C C C C C C C C C C
charge: -0.218327 -0.080894 0.075938 0.327433 -0.112091 0.046458 0.173311 0.470972 0.406902 -0.133327 -0.109938 -0.236364 -0.036751 -0.198713 0.019098 0.021453 -0.223826 -0.115069 -0.040466 -0.018852 0.002480 -0.004513 -0.014914
polarizability: 3.21698373e+02 -4.48377549e+00 1.72718278e+02 -1.72361583e+00 3.05484140e+01 2.38728298e+02
1716.lowfreq: -24.3052 -6.9277 -0.1307 -0.0007 0.0004 0.0006 5.0944 22.7874 25.6612
frequency: -23.1221 22.6707 25.5967 36.2207 40.7312 54.7782 78.6773 118.1270 140.0205 162.6177 179.2501 185.2175 211.2520 216.0635 239.7123 246.1018 256.6287 322.3014 342.1830 367.1627 387.1122 405.6444 408.8848 434.8021 452.6509 466.3720 474.5257 490.9833 501.6109 541.5178 552.7099 590.9450 616.5476 625.2893 660.1780 696.9571 706.6971 742.2541 751.0838 778.7595 782.8019 786.5534 809.4728 809.7803 824.0094 840.9332 857.6809 870.7455 894.2040 916.1371 933.2072 960.3117 973.4684 979.7824 984.4490 989.9493 990.9325 997.3896 1010.1527 1021.1898 1025.7816 1032.9849 1041.2744 1050.2836 1072.3170 1082.0095 1087.0256 1104.9844 1122.1131 1142.9648 1146.9569 1169.8131 1171.0345 1179.4708 1182.1295 1203.5453 1210.6789 1222.9583 1233.4944 1252.1559 1263.3920 1274.8736 1294.3526 1311.8826 1327.3437 1340.3339 1354.7732 1368.3134 1375.2939 1387.9923 1405.8444 1414.6480 1417.6869 1438.1733 1439.7927 1441.1905 1452.4467 1459.4779 1465.2224 1468.1635 1472.9625 1476.5299 1479.6321 1484.1552 1486.5500 1515.1576 1581.2491 1591.5981 1595.2863 1613.8678 1627.3934 2836.9000 2841.2270 2859.7703 2904.3491 3014.8894 3015.4091 3017.9242 3027.6010 3031.1146 3077.8872 3086.8014 3096.9533 3112.5729 3119.0722 3122.0448 3123.3075 3132.4648 3134.9918 3140.2410 3145.9561 3151.4777 3157.5119 3162.1868 3166.5493
redmass: 2.5146 4.4357 4.7394 3.7516 4.1130 4.1140 2.8188 3.1956 3.7183 3.7847 3.4007 3.4043 4.0101 1.1539 1.7900 1.7726 3.1221 2.6229 2.8460 2.8524 2.5958 2.8057 2.7255 2.9175 3.7737 3.4513 3.5068 4.4565 4.2307 5.0237 5.9439 3.2857 6.3596 5.0354 3.2392 4.6606 1.9219 1.3733 1.6580 2.3268 1.7760 1.8565 3.5736 2.0882 3.4451 4.2658 1.2481 1.4971 1.5618 1.4864 3.1029 1.3399 1.3762 1.3959 1.9366 2.2820 2.0305 1.3705 3.1040 2.7501 2.1695 1.5889 2.0720 2.4073 2.2280 1.5830 1.2804 1.9412 2.1293 1.7034 1.4803 1.0819 1.0612 1.2638 1.1288 2.1744 2.3192 1.4591 1.9312 1.5925 2.3282 1.8281 1.3470 1.3081 1.3133 1.4519 1.5460 2.3547 1.5346 5.0371 2.4321 7.0304 1.1468 1.9937 1.3354 1.9227 2.0477 1.1102 1.1041 1.1067 1.1255 1.3871 1.0847 1.0625 1.4745 3.9597 6.3982 5.8794 6.1333 6.1233 6.6059 1.0677 1.0576 1.0595 1.0690 1.0880 1.0688 1.0723 1.0709 1.0839 1.1007 1.1002 1.1010 1.0874 1.0860 1.0853 1.0859 1.0893 1.0911 1.0920 1.0960 1.0948 1.0980 1.1015 1.0983
irintensity: 0.6008 0.0596 0.0630 0.0751 0.4696 0.2305 0.1302 0.2000 0.4929 1.9104 0.0662 6.0021 0.0688 1.1843 4.0869 0.4603 0.1487 4.7628 1.8836 8.2453 6.0105 1.5840 1.6584 3.3748 1.6292 12.4409 1.8954 8.7325 7.6080 8.7920 1.4776 4.0791 0.1593 5.5875 1.6620 7.6234 41.7791 13.3287 33.1471 45.4288 10.9996 49.2986 3.7066 82.8404 3.7911 2.5807 0.2393 1.3579 4.1943 14.2202 31.7834 0.6648 5.0283 1.6956 12.4776 1.4313 0.1311 3.5858 13.6847 32.3586 8.5880 21.5195 36.9490 29.6302 13.2302 9.4714 5.3468 13.0250 39.6841 4.6833 2.0221 3.0016 0.2872 3.6426 2.6617 1.7032 5.1144 52.0048 6.9416 2.9945 5.3521 21.1384 24.6153 5.7685 9.0422 1.1595 28.5767 14.2989 7.1991 3.3125 45.8238 20.1787 0.9088 16.3612 6.6824 7.4438 51.5602 9.2094 12.8964 3.6985 14.7244 22.6868 21.6523 13.7267 3.0126 31.5689 97.3359 3.2186 1.5552 4.4090 2.5039 71.0770 72.1385 196.8683 81.6654 20.3365 5.7590 38.9675 57.9755 21.8491 28.3074 44.5557 22.1691 8.6274 2.5348 2.3517 0.2831 10.2929 13.6475 33.4473 38.2611 40.1728 28.2234 27.6787 18.9696
temp: 298.150 k
press: 1.00000 atm
elementType: 7 7 6 6 6 6 6 6 6 6 6 6 6 6 6 6 6 6 6 6 6 6 6 1 1 1 1 1 1 1 1 1 1 1 1 1 1 1 1 1 1 1 1 1 1 1 1
symmnumber: 1
zpe: 1038375.0 jmol-1
zpe.correction: 0.395496 hartree
zpe.thermalcorrener: 0.415871 hartree
zpe.thermalcorrenthalpy: 0.416815 hartree
zpe.thermalcorrgfe: 0.344775 hartree
zpe.sumelectzpe: -922.448936 hartree
zpe.sumelectthermal: -922.428561 hartree
zpe.sumelectthermalent: -922.427617 hartree
zpe.sumelectthermalfe: -922.499657 hartree
dipole: -1.4745 0.8836 0.6665
dipole: 1.8437
quadrupole: -124.8765 -137.8149 -130.3642
quadrupole: -1.6692 0.0914 7.3407
quadrupole: 6.1421 -6.7964 0.6543 -1.6692 0.0914 7.3407
hfenergy: -922.8444321 hartree
pointgroup: C01 [X(C21H24N2)]
dipole: 0.2515245 -0.6396535 -0.2317872 debye
polarizability: 180.9113|21.8985659|318.4710117|-34.3493516|7.3723704|233.7626375 unknown
InChI: InChI=1S/C21H24N2/c1-22(2)15-16-23(17-18-9-4-3-5-10-18)21-14-8-12-19-11-6-7-13-20(19)21/h3-14H,15-17H2,1-2H3
charge 0 multiplicity 1
47 atoms
N  -0.07027 -0.142266 -0.41056
N  3.126447 -1.777518 0.957117
C  0.884305 -0.730302 0.572013
C  0.1762 1.193229 -0.858228
C  -0.634958 -1.103684 -1.388093
C  2.251133 -1.130299 -0.048067
C  0.086677 2.294011 0.087885
C  -1.438897 -2.212458 -0.711841
C  0.415336 3.634752 -0.35607
C  0.465606 1.479494 -2.206267
C  -0.374057 2.115497 1.434139
C  0.744767 3.869588 -1.732567
C  0.735819 2.811271 -2.641544
C  0.360061 4.714253 0.588144
C  4.563521 -1.630484 0.64946
C  2.766236 -3.186686 1.216192
C  -1.236033 -3.569121 -1.062248
C  -2.429784 -1.894274 0.252039
C  -0.439013 3.190138 2.325248
C  -0.044423 4.499365 1.907082
C  -2.011994 -4.592476 -0.468283
C  -3.204201 -2.912269 0.848796
C  -2.998803 -4.266475 0.489263
H  1.086849 -0.00576 1.375872
H  0.397762 -1.607385 1.0347
H  0.140835 -1.569633 -2.038724
H  -1.303578 -0.526479 -2.054924
H  2.097268 -1.787219 -0.943167
H  2.750559 -0.210532 -0.405091
H  0.528858 0.663961 -2.933968
H  -0.717315 1.12405 1.744594
H  0.984557 4.888283 -2.058315
H  0.969116 2.988931 -3.697519
H  0.628467 5.721779 0.247753
H  4.816082 -0.56052 0.546473
H  4.875281 -2.153867 -0.290907
H  5.163852 -2.043832 1.480468
H  3.374203 -3.576926 2.052005
H  2.932101 -3.849201 0.32699
H  1.704891 -3.268851 1.504878
H  -0.468147 -3.826772 -1.802955
H  -2.575442 -0.844305 0.531635
H  -0.806272 3.034002 3.345657
H  -0.085226 5.333592 2.616263
H  -1.84387 -5.638512 -0.748905
H  -3.968532 -2.653533 1.590546
H  -3.600274 -5.057055 0.95203
