program: Orca
programVersion: 4.2.1
elementType: Cl Cl F O O O N N C C C C C C C H H H H H
charge: 0
multiplicity: 1
keywords: wb97x-d3
keywords: def2-TZVPP
keywords: def2/J RIJCOSX GRIDX6 NOFINALGRIDX
keywords: grid4 nofinalgrid
keywords: scfconv7
keywords: smallprint printgap noloewdin
keywords: NOSOSCF
formula: C7H5Cl2FN2O3
InChI: InChI=1/C7H5Cl2FN2O3/c8-3-5(11)4(9)7(12-6(3)10)15-1-2(13)14/h13H,1,11H2
20 atoms
Cl -0.201001 2.981711 0.100046
Cl -3.350727 -1.439197 0.109693
F  -0.78852 -2.676787 -0.550286
O  1.822273 1.008022 -0.549189
O  4.208743 -1.526057 0.218905
O  2.776598 -0.452475 1.56464
N  0.491472 -0.849731 -0.546739
N  -2.78903 1.49984 0.358862
C  -1.718752 0.737667 0.078431
C  0.623778 0.45166 -0.389028
C  -0.44116 1.287225 -0.086105
C  -1.830213 -0.656168 -0.082035
C  -0.694861 -1.368087 -0.390663
C  2.906544 0.14612 -0.767026
C  3.255633 -0.631292 0.485561
H  2.731573 -0.544095 -1.596046
H  3.748721 0.787541 -1.034844
H  -3.664986 1.068754 0.588975
H  -2.666425 2.469629 0.584151
H  4.426263 -1.996688 1.033967
totalener: -1625.30710775 hartree
nucrepener: 1252.34526280 hartree
electener: -2877.65237056 hartree
oneelecener: -4726.56547698 hartree
twoeener: 1848.91310642 hartree
kineticenergy: 1621.39218830 hartree
xcener: -104.975338364413 hartree
chargesum: -0.0000000
charge: -0.079627 -0.079171 -0.166037 -0.264190 -0.270862 -0.322098 -0.342895 -0.239275 0.174589 0.432887 -0.102128 -0.101991 0.267654 0.021121 0.308156 0.114462 0.131911 0.152557 0.154261 0.210675
qa: -0.0796 -0.0792 -0.1660 -0.2642 -0.2709 -0.3221 -0.3429 -0.2393 0.1746 0.4329 -0.1021 -0.1020 0.2677 0.0211 0.3082 0.1145 0.1319 0.1526 0.1543 0.2107
va: 1.2533 1.2401 1.1462 2.1596 2.1903 2.1715 2.9773 3.2379 3.9442 3.9694 3.9067 3.8644 4.3618 3.8377 4.2568 1.0230 1.0015 1.0515 1.0520 1.0379
dispcorr: -0.008300392 hartree
energy: -1625.315408144827
dipole: 9.91798 -9.97014 -0.05216 2.07903 -1.61034 0.46869 -0.15135 0.04266 -0.10869
magnitude: 0.48394 au
magnitude: 1.23009 debye
