program: Orca
programVersion: 4.2.1
elementType: Cl Cl F F O O O N N C C C C C C C C C C C C C H H H H H H H H
charge: 0
multiplicity: 1
keywords: wb97x-d3
keywords: def2-TZVPP
keywords: def2/J RIJCOSX GRIDX6 NOFINALGRIDX
keywords: grid4 nofinalgrid
keywords: scfconv7
keywords: smallprint printgap noloewdin
keywords: NOSOSCF
formula: C13H8Cl2F2N2O3
InChI: InChI=1/C13H8Cl2F2N2O3/c1-22-12-5(14)3-2-4(7(12)16)10-8(17)9(18)6(15)11(19-10)13(20)21/h2-3,20H,18H2,1H3
30 atoms
Cl 4.898751 -0.673683 0.040419
Cl -5.353455 1.17511 0.280839
F  -1.341016 -1.339049 -1.380973
F  0.197784 -2.178253 0.839785
O  -4.047277 -0.828516 -1.359604
O  2.735698 3.023024 -1.056319
O  4.631975 2.176954 -0.242338
N  1.320798 1.065203 -0.128333
N  2.865034 -2.671358 0.788841
C  -0.935507 0.327125 0.218994
C  0.516037 0.057173 0.179195
C  -1.819312 -0.394805 -0.56346
C  1.02071 -1.184502 0.488641
C  -1.444457 1.354436 1.006705
C  2.389238 -1.458202 0.46505
C  -3.18993 -0.158587 -0.569741
C  2.631327 0.869072 -0.153518
C  3.207374 -0.365737 0.124282
C  -2.800428 1.624779 1.02642
C  -3.661206 0.861513 0.253544
C  3.454852 2.073797 -0.481135
C  -4.108121 -2.250227 -1.224952
H  -0.773695 1.940782 1.618756
H  -3.18947 2.414867 1.652808
H  2.236014 -3.453338 0.851298
H  3.827631 -2.894409 0.604136
H  -5.127875 -2.543181 -1.466384
H  -3.888449 -2.569009 -0.205111
H  -3.429224 -2.749356 -1.916482
H  3.301045 3.790964 -1.232153
elementType: Cl F O N C H
totalener: -1955.60684279 hartree
nucrepener: 2075.47279055 hartree
electener: -4031.07963333 hartree
oneelecener: -6817.52981913 hartree
twoeener: 2786.45018580 hartree
cpcmener: -0.03647687 hartree
kineticenergy: 1950.36901103 hartree
xcener: -135.674754832248 hartree
chargesum: -0.0000000
charge: -0.059059 -0.076445 -0.214653 -0.213999 -0.351723 -0.280575 -0.428621 -0.365311 -0.235367 -0.080756 0.236577 0.315216 0.257006 -0.167765 0.063491 0.079122 0.140626 -0.032192 -0.178257 0.048214 0.373532 -0.102065 0.147390 0.145476 0.185827 0.179444 0.119364 0.116401 0.114094 0.265009
qa: -0.0591 -0.0764 -0.2147 -0.2140 -0.3517 -0.2806 -0.4286 -0.3653 -0.2354 -0.0808 0.2366 0.3152 0.2570 -0.1678 0.0635 0.0791 0.1406 -0.0322 -0.1783 0.0482 0.3735 -0.1021 0.1474 0.1455 0.1858 0.1794 0.1194 0.1164 0.1141 0.2650
va: 1.2775 1.2371 1.0858 1.0898 2.0242 2.2077 2.0488 3.0432 3.2645 3.6015 3.6972 3.8589 3.9154 3.9619 4.0610 3.9986 3.7934 4.0122 4.0374 3.8659 4.3250 3.8282 1.0118 1.0085 1.0121 1.0292 0.9940 0.9897 0.9901 0.9873
dispcorr: -0.014006434 hartree
energy: -1955.620849220376
dipole: -4.95246 5.10718 0.15472 -3.12040 1.23846 -1.88194 0.14649 0.45648 0.60296
magnitude: 1.98222 au
magnitude: 5.03841 debye
