program: Orca
programVersion: 4.2.1
elementType: Cl Cl O O O C C C C C C C C C H H H H H H H H
charge: 0
multiplicity: 1
keywords: wb97x-d3
keywords: def2-TZVPP
keywords: def2/J RIJCOSX GRIDX6 NOFINALGRIDX
keywords: grid4 nofinalgrid
keywords: scfconv7
keywords: smallprint printgap noloewdin
keywords: NOSOSCF
formula: C9H8Cl2O3
InChI: InChI=1/C9H8Cl2O3/c1-5(9(12)13)14-8-3-2-6(10)4-7(8)11/h2-5,12H,1H3
22 atoms
Cl 0.222348 2.256057 -1.169564
Cl 4.414184 -0.491748 0.766448
O  -1.335499 0.104208 -0.161123
O  -3.493368 0.360492 -1.418074
O  -4.517547 -1.353516 -0.417237
C  -2.306667 -0.825389 0.277021
C  -0.037206 -0.107874 0.09846
C  -2.637981 -0.647351 1.75152
C  0.850647 0.876896 -0.346859
C  0.488654 -1.214689 0.756445
C  -3.556537 -0.635387 -0.558859
C  2.213564 0.7667 -0.148752
C  1.855317 -1.336837 0.96173
C  2.708446 -0.347892 0.510179
H  -1.976188 -1.852854 0.086126
H  -3.400697 -1.361683 2.055681
H  -3.005897 0.359324 1.949798
H  -1.76246 -0.820935 2.375805
H  -0.149677 -2.005731 1.124302
H  2.876447 1.542591 -0.505734
H  2.237524 -2.206818 1.476803
H  -4.3285 0.420038 -1.908982
elementType: Cl O C H
totalener: -1493.94749899 hartree
nucrepener: 1071.69091059 hartree
electener: -2565.63840958 hartree
oneelecener: -4182.21074504 hartree
twoeener: 1616.57233546 hartree
cpcmener: -0.02784166 hartree
kineticenergy: 1490.24317944 hartree
xcener: -95.857043187384 hartree
chargesum: -0.0000000
charge: -0.081735 -0.097258 -0.295510 -0.270681 -0.471856 0.119089 0.331193 -0.256479 -0.087385 -0.204771 0.419546 -0.083620 -0.179443 0.051219 0.107368 0.105494 0.109615 0.100160 0.146130 0.125505 0.149038 0.264381
qa: -0.0817 -0.0973 -0.2955 -0.2707 -0.4719 0.1191 0.3312 -0.2565 -0.0874 -0.2048 0.4195 -0.0836 -0.1794 0.0512 0.1074 0.1055 0.1096 0.1002 0.1461 0.1255 0.1490 0.2644
va: 1.2348 1.2053 2.0975 2.2308 2.0262 3.8372 3.8053 3.9112 3.9430 3.9185 4.2106 3.9956 4.0258 3.8605 1.0098 1.0202 1.0030 1.0035 1.0030 1.0189 1.0030 0.9870
dispcorr: -0.009418017 hartree
energy: -1493.956917009216
dipole: -15.28698 14.89648 -0.39050 -7.95450 7.47622 -0.47828 6.75146 -6.38006 0.37141
magnitude: 0.72054 au
magnitude: 1.83148 debye
