program: Orca
programVersion: 4.2.1
elementType: Cl Cl O O O C C C C C C C C C H H H H H H H H
charge: 0
multiplicity: 1
keywords: wb97x-d3
keywords: def2-TZVPP
keywords: def2/J RIJCOSX GRIDX6 NOFINALGRIDX
keywords: grid4 nofinalgrid
keywords: scfconv7
keywords: smallprint printgap noloewdin
keywords: NOSOSCF
formula: C9H8Cl2O3
InChI: InChI=1/C9H8Cl2O3/c1-5(9(12)13)14-8-3-2-6(10)4-7(8)11/h2-5,12H,1H3
22 atoms
Cl 0.19281 2.405938 -0.897207
Cl 4.426291 -0.49115 0.698595
O  -1.330058 0.110926 -0.188349
O  -4.343765 -1.580496 -0.697646
O  -3.739359 0.524242 -1.1602
C  -2.279699 -0.879963 0.149711
C  -0.028696 -0.105012 0.057204
C  -2.608288 -0.867232 1.637043
C  0.842168 0.944546 -0.253044
C  0.515381 -1.276248 0.574196
C  -3.518069 -0.545015 -0.655445
C  2.20618 0.834472 -0.061314
C  1.883038 -1.398863 0.771348
C  2.719392 -0.345677 0.453675
H  -1.934933 -1.873185 -0.155779
H  -2.999992 0.103865 1.93955
H  -1.724764 -1.081548 2.237041
H  -3.351583 -1.627849 1.870398
H  -0.109073 -2.119407 0.834181
H  2.855976 1.661529 -0.31141
H  2.279579 -2.319979 1.174528
H  -5.159018 -1.340524 -1.165189
elementType: Cl O C H
totalener: -1493.94829995 hartree
nucrepener: 1069.57285707 hartree
electener: -2563.52115702 hartree
oneelecener: -4178.31849156 hartree
twoeener: 1614.79733454 hartree
cpcmener: -0.03086333 hartree
kineticenergy: 1490.24240061 hartree
xcener: -95.856439775802 hartree
chargesum: -0.0000000
charge: -0.081364 -0.097305 -0.290975 -0.299787 -0.437165 0.113395 0.328550 -0.257827 -0.081356 -0.204392 0.406823 -0.086083 -0.179978 0.054125 0.103638 0.107976 0.101662 0.110815 0.146980 0.125326 0.148136 0.268805
qa: -0.0814 -0.0973 -0.2910 -0.2998 -0.4372 0.1134 0.3286 -0.2578 -0.0814 -0.2044 0.4068 -0.0861 -0.1800 0.0541 0.1036 0.1080 0.1017 0.1108 0.1470 0.1253 0.1481 0.2688
va: 1.2351 1.2053 2.1118 2.1952 2.0605 3.8575 3.8090 3.9029 3.9379 3.9107 4.2435 3.9984 4.0254 3.8577 1.0151 1.0055 1.0020 1.0155 1.0017 1.0190 1.0035 0.9852
dispcorr: -0.009391059 hartree
energy: -1493.957691008115
dipole: -15.84965 14.75007 -1.09959 -10.65763 8.47121 -2.18642 6.28723 -5.40088 0.88635
magnitude: 2.60291 au
magnitude: 6.61608 debye
