program: Orca
programVersion: 4.2.1
elementType: Cl Cl O O O C C C C C C C C C H H H H H H H H
charge: 0
multiplicity: 1
keywords: wb97x-d3
keywords: def2-TZVPP
keywords: def2/J RIJCOSX GRIDX6 NOFINALGRIDX
keywords: grid4 nofinalgrid
keywords: scfconv7
keywords: smallprint printgap noloewdin
keywords: NOSOSCF
formula: C9H8Cl2O3
InChI: InChI=1/C9H8Cl2O3/c1-5(9(12)13)14-8-3-2-6(10)4-7(8)11/h2-5,12H,1H3
22 atoms
Cl 0.370813 2.739232 -0.513556
Cl 4.112138 -1.064608 0.135294
O  -1.462653 0.719538 0.30513
O  -3.564786 -2.092941 -0.18056
O  -2.356988 -0.9235 -1.657352
C  -2.537003 -0.137269 0.614047
C  -0.213858 0.229034 0.271441
C  -3.760047 0.735076 0.844061
C  0.796609 1.120559 -0.099613
C  0.148202 -1.073941 0.595291
C  -2.784484 -1.088955 -0.546558
C  2.12259 0.733322 -0.143641
C  1.47505 -1.475717 0.552662
C  2.453833 -0.571657 0.186083
H  -2.336261 -0.709887 1.526674
H  -3.568251 1.429771 1.660731
H  -4.615893 0.122808 1.122178
H  -4.01756 1.306335 -0.047609
H  -0.588155 -1.807343 0.893869
H  2.884158 1.443816 -0.43465
H  1.728865 -2.494542 0.809792
H  -3.764382 -2.660705 -0.941514
elementType: Cl O C H
totalener: -1493.95717210 hartree
nucrepener: 1084.38812336 hartree
electener: -2578.34529546 hartree
oneelecener: -4208.06069294 hartree
twoeener: 1629.71539749 hartree
cpcmener: -0.02440662 hartree
kineticenergy: 1490.25209267 hartree
xcener: -95.856381937993 hartree
chargesum: 0.0000000
charge: -0.080397 -0.095040 -0.291681 -0.291478 -0.404245 0.130699 0.314171 -0.266412 -0.079464 -0.181956 0.354581 -0.083870 -0.174167 0.053126 0.115809 0.104535 0.102313 0.106886 0.134984 0.124348 0.145324 0.261935
qa: -0.0804 -0.0950 -0.2917 -0.2915 -0.4042 0.1307 0.3142 -0.2664 -0.0795 -0.1820 0.3546 -0.0839 -0.1742 0.0531 0.1158 0.1045 0.1023 0.1069 0.1350 0.1243 0.1453 0.2619
va: 1.2347 1.2071 2.1171 2.2075 2.0899 3.8163 3.8007 3.9538 3.9500 3.9081 4.1943 4.0035 4.0335 3.8685 1.0027 1.0059 1.0121 1.0041 1.0124 1.0188 1.0046 0.9916
dispcorr: -0.009688874 hartree
energy: -1493.966860974868
dipole: -19.49589 17.80874 -1.68716 -5.46076 4.17082 -1.28994 4.91490 -3.76968 1.14521
magnitude: 2.41287 au
magnitude: 6.13303 debye
