program: Orca
programVersion: 4.2.1
elementType: Cl Cl O O O C C C C C C C C H H H H H H
charge: 0
multiplicity: 1
keywords: wb97x-d3
keywords: def2-TZVPP
keywords: def2/J RIJCOSX GRIDX6 NOFINALGRIDX
keywords: grid4 nofinalgrid
keywords: scfconv7
keywords: smallprint printgap noloewdin
keywords: NOSOSCF
formula: C8H6Cl2O3
InChI: InChI=1/C8H6Cl2O3/c1-13-7-5(10)3-2-4(9)6(7)8(11)12/h2-3,11H,1H3
19 atoms
Cl 2.714366 -1.610246 -0.08798
Cl -3.299938 -0.091487 0.089585
O  -1.016071 1.782175 0.338888
O  2.326678 1.16908 1.415058
O  1.904045 2.070437 -0.585463
C  0.678343 0.150427 0.115435
C  -0.670745 0.497096 0.136232
C  1.046163 -1.179075 -0.0391
C  -1.631548 -0.503027 0.003718
C  0.087646 -2.166645 -0.18988
C  -1.252487 -1.824707 -0.157931
C  1.693703 1.239589 0.250506
C  -1.3452 2.523049 -0.831947
H  0.384727 -3.19726 -0.320018
H  -2.009045 -2.590239 -0.258899
H  -2.22124 2.111889 -1.33742
H  -0.505227 2.557524 -1.526681
H  -1.574464 3.533313 -0.501723
H  2.989482 1.87263 1.451301
totalener: -1454.60892079 hartree
nucrepener: 1002.18424296 hartree
electener: -2456.79316375 hartree
oneelecener: -3991.23503995 hartree
twoeener: 1534.44187620 hartree
kineticenergy: 1451.19781891 hartree
xcener: -91.682973684915 hartree
chargesum: 0.0000000
charge: -0.052981 -0.057485 -0.325889 -0.242268 -0.329446 0.026640 0.200159 0.067694 -0.012876 -0.158979 -0.110829 0.329044 -0.110127 0.123809 0.123262 0.095512 0.112518 0.115263 0.206981
qa: -0.0530 -0.0575 -0.3259 -0.2423 -0.3294 0.0266 0.2002 0.0677 -0.0129 -0.1590 -0.1108 0.3290 -0.1101 0.1238 0.1233 0.0955 0.1125 0.1153 0.2070
va: 1.2683 1.2582 2.0365 2.2139 2.1523 3.6584 3.9777 4.0008 3.9920 4.0390 4.0144 4.3152 3.8537 1.0116 1.0126 0.9976 0.9994 0.9947 1.0382
dispcorr: -0.008566412 hartree
energy: -1454.617487197789
dipole: -2.06907 1.96830 -0.10076 6.25726 -6.53436 -0.27711 -2.42794 2.44335 0.01541
magnitude: 0.29526 au
magnitude: 0.75050 debye
