program: Orca
programVersion: 4.2.1
elementType: Cl Cl O O N C C C C C C C C C C C C C C C C H H H H H H H H H H H H H H H
charge: 0
multiplicity: 1
keywords: wb97x-d3
keywords: def2-TZVPP
keywords: def2/J RIJCOSX GRIDX6 NOFINALGRIDX
keywords: grid4 nofinalgrid
keywords: scfconv7
keywords: smallprint printgap noloewdin
keywords: NOSOSCF
formula: C16H15Cl2NO2
InChI: InChI=1/C16H15Cl2NO2/c1-10-13(17)8-9-14(15(10)18)21-11(2)16(20)19-12-6-4-3-5-7-12/h3-9,11,19H,1-2H3
36 atoms
Cl -2.505785 -2.674505 0.03424
Cl -4.436252 2.349069 -0.581822
O  -0.089137 -1.288313 0.905921
O  2.272722 -1.095744 -1.720785
N  2.363107 -0.221259 0.383709
C  0.666423 -1.878105 -0.151338
C  -1.093486 -0.448602 0.528449
C  1.841275 -1.002258 -0.583134
C  1.180397 -3.222266 0.328752
C  -3.386156 -0.142205 -0.274415
C  -2.313634 -0.958108 0.090839
C  -0.933069 0.923943 0.618212
C  3.472323 0.634059 0.33392
C  -3.174858 1.233067 -0.167791
C  -1.975514 1.765011 0.276849
C  -4.671388 -0.749224 -0.740882
C  3.756791 1.348614 1.499944
C  4.288823 0.803449 -0.783851
C  4.835258 2.213862 1.551432
C  5.367368 1.676188 -0.716654
C  5.6510 2.384688 0.440279
H  0.043656 -2.016477 -1.039339
H  1.800002 -3.11893 1.219753
H  1.777131 -3.696266 -0.448926
H  0.344858 -3.881303 0.560429
H  1.903919 -0.262376 1.282638
H  -0.000964 1.342389 0.971936
H  -1.848351 2.835403 0.354116
H  -5.124003 -1.356158 0.043925
H  -4.50541 -1.400779 -1.59896
H  -5.396599 0.003226 -1.03435
H  3.128478 1.223346 2.374218
H  4.102056 0.269344 -1.700108
H  5.03654 2.755672 2.465926
H  5.993486 1.795709 -1.591107
H  6.495617 3.059212 0.477885
elementType: Cl O N C H
totalener: -1744.45187392 hartree
nucrepener: 1867.72386080 hartree
electener: -3612.17573472 hartree
oneelecener: -6103.30858918 hartree
twoeener: 2491.13285445 hartree
cpcmener: -0.02715507 hartree
kineticenergy: 1739.53331091 hartree
xcener: -122.429109196487 hartree
chargesum: 0.0000000
charge: -0.077172 -0.090297 -0.383052 -0.519293 -0.136739 0.134704 0.203921 0.340374 -0.242251 -0.012216 0.002838 -0.164925 0.229519 0.065523 -0.154428 -0.210603 -0.243136 -0.258889 -0.116306 -0.135020 -0.205408 0.109325 0.106404 0.103982 0.095504 0.175187 0.149262 0.142788 0.110907 0.108466 0.084969 0.139205 0.158885 0.163208 0.161934 0.162831
qa: -0.0772 -0.0903 -0.3831 -0.5193 -0.1367 0.1347 0.2039 0.3404 -0.2423 -0.0122 0.0028 -0.1649 0.2295 0.0655 -0.1544 -0.2106 -0.2431 -0.2589 -0.1163 -0.1350 -0.2054 0.1093 0.1064 0.1040 0.0955 0.1752 0.1493 0.1428 0.1109 0.1085 0.0850 0.1392 0.1589 0.1632 0.1619 0.1628
va: 1.2689 1.2334 1.9580 1.9930 3.2650 3.8237 3.8662 4.0871 3.9318 3.6936 3.9706 3.9833 3.7187 3.8027 4.0298 3.9066 3.9532 3.9641 3.8850 3.9054 3.9186 1.0187 1.0028 1.0124 1.0133 1.0223 1.0007 1.0064 0.9977 0.9994 1.0242 1.0096 1.0399 0.9886 0.9907 0.9894
dispcorr: -0.017580081 hartree
energy: -1744.469454004843
dipole: 22.33139 -22.38057 -0.04918 -1.88888 2.20094 0.31207 2.83702 -1.31541 1.52162
magnitude: 1.55407 au
magnitude: 3.95012 debye
