program: Orca
programVersion: 4.2.1
elementType: Cl Cl O O N C C C C C C C C C C C C C C C C H H H H H H H H H H H H H H H
charge: 0
multiplicity: 1
keywords: wb97x-d3
keywords: def2-TZVPP
keywords: def2/J RIJCOSX GRIDX6 NOFINALGRIDX
keywords: grid4 nofinalgrid
keywords: scfconv7
keywords: smallprint printgap noloewdin
keywords: NOSOSCF
formula: C16H15Cl2NO2
InChI: InChI=1/C16H15Cl2NO2/c1-10-13(17)8-9-14(15(10)18)21-11(2)16(20)19-12-6-4-3-5-7-12/h3-9,11,19H,1-2H3
36 atoms
Cl -0.844722 1.661601 -0.50327
Cl -5.807986 -0.419373 0.143346
O  0.003981 -1.018923 0.189651
O  2.768771 -0.6877 -1.997286
N  2.423872 -0.112258 0.182047
C  0.655993 -1.218512 -1.066225
C  -1.347667 -0.879657 0.150484
C  2.061745 -0.634727 -1.002584
C  0.704469 -2.693555 -1.420727
C  -3.304649 0.540347 -0.193927
C  -1.922996 0.350858 -0.168073
C  -2.160841 -1.95247 0.467913
C  3.646785 0.445742 0.574356
C  -4.082551 -0.572834 0.134422
C  -3.53578 -1.798805 0.466655
C  -3.949604 1.844655 -0.539924
C  3.724002 0.893237 1.895231
C  4.762584 0.570654 -0.252984
C  4.891327 1.452438 2.383487
C  5.927806 1.133608 0.25222
C  6.005414 1.576653 1.563473
H  0.128392 -0.674396 -1.856865
H  -0.304896 -3.099386 -1.490072
H  1.258822 -3.263891 -0.675265
H  1.177163 -2.835356 -2.390806
H  1.711526 -0.127985 0.898157
H  -1.718205 -2.903637 0.731181
H  -4.173588 -2.633817 0.719589
H  -3.227485 2.596348 -0.842607
H  -4.504904 2.241326 0.310804
H  -4.6587 1.719928 -1.358264
H  2.862347 0.798241 2.545618
H  4.739706 0.238431 -1.277391
H  4.927793 1.790424 3.410576
H  6.786757 1.22349 -0.399801
H  6.919859 2.012301 1.942599
elementType: Cl O N C H
totalener: -1744.45288688 hartree
nucrepener: 1861.30116398 hartree
electener: -3605.75405085 hartree
oneelecener: -6090.61787386 hartree
twoeener: 2484.86382300 hartree
cpcmener: -0.02585877 hartree
kineticenergy: 1739.54699380 hartree
xcener: -122.434110281721 hartree
chargesum: 0.0000000
charge: -0.078938 -0.089386 -0.396510 -0.535843 -0.115996 0.132667 0.267996 0.372042 -0.275342 0.017346 -0.010897 -0.217116 0.222678 0.016820 -0.123099 -0.216336 -0.241291 -0.252260 -0.118684 -0.137450 -0.203911 0.101365 0.098093 0.105483 0.103848 0.173276 0.163300 0.145922 0.087147 0.112792 0.106358 0.138380 0.158682 0.163146 0.162662 0.163055
qa: -0.0789 -0.0894 -0.3965 -0.5358 -0.1160 0.1327 0.2680 0.3720 -0.2753 0.0173 -0.0109 -0.2171 0.2227 0.0168 -0.1231 -0.2163 -0.2413 -0.2523 -0.1187 -0.1375 -0.2039 0.1014 0.0981 0.1055 0.1038 0.1733 0.1633 0.1459 0.0871 0.1128 0.1064 0.1384 0.1587 0.1631 0.1627 0.1631
va: 1.2645 1.2381 1.9420 1.9806 3.2491 3.8823 3.7700 4.0749 3.9456 3.6429 3.9301 4.0256 3.7394 3.8707 3.9978 3.9080 3.9536 3.9501 3.8870 3.9086 3.9175 1.0107 1.0052 1.0045 1.0223 1.0349 0.9920 1.0040 1.0235 0.9971 1.0001 1.0102 1.0392 0.9885 0.9902 0.9892
dispcorr: -0.017259938 hartree
energy: -1744.470146814603
dipole: 20.18798 -21.28445 -1.09647 -4.46262 4.03975 -0.42287 0.70476 0.55383 1.25858
magnitude: 1.72195 au
magnitude: 4.37684 debye
