program: Orca
programVersion: 4.2.1
elementType: Cl Cl O O N C C C C C C C C C C C C C C C C H H H H H H H H H H H H H H H
charge: 0
multiplicity: 1
keywords: wb97x-d3
keywords: def2-TZVPP
keywords: def2/J RIJCOSX GRIDX6 NOFINALGRIDX
keywords: grid4 nofinalgrid
keywords: scfconv7
keywords: smallprint printgap noloewdin
keywords: NOSOSCF
formula: C16H15Cl2NO2
InChI: InChI=1/C16H15Cl2NO2/c1-10-13(17)8-9-14(15(10)18)21-11(2)16(20)19-12-6-4-3-5-7-12/h3-9,11,19H,1-2H3
36 atoms
Cl -1.065926 0.671434 1.810284
Cl -5.792877 0.009518 -0.770355
O  0.001194 -0.607373 -0.427005
O  3.07921 -0.942141 -2.068706
N  2.477627 -0.082261 -0.042276
C  0.818701 -1.211536 -1.414051
C  -1.327315 -0.502638 -0.577686
C  2.247257 -0.714541 -1.209412
C  0.787587 -2.72792 -1.312289
C  -3.395463 0.303171 0.45512
C  -2.01581 0.120137 0.470351
C  -2.040368 -0.952329 -1.677896
C  3.669296 0.45118 0.461395
C  -4.071189 -0.171738 -0.673174
C  -3.414788 -0.784345 -1.721024
C  -4.147859 0.967249 1.564165
C  3.586885 1.092371 1.699339
C  4.903238 0.373951 -0.18458
C  4.712272 1.646941 2.282622
C  6.023135 0.936544 0.413463
C  5.941884 1.574057 1.64186
H  0.520959 -0.883693 -2.415507
H  1.105573 -3.057302 -0.322305
H  1.454538 -3.167607 -2.052408
H  -0.211211 -3.121914 -1.49824
H  1.669764 0.039127 0.551351
H  -1.551973 -1.436312 -2.511889
H  -3.965563 -1.140002 -2.580701
H  -4.893754 0.292034 1.985356
H  -4.679468 1.84682 1.198897
H  -3.500595 1.288162 2.374444
H  2.633993 1.158137 2.212741
H  5.004105 -0.115973 -1.13897
H  4.623929 2.13837 3.24278
H  6.974658 0.869435 -0.098237
H  6.823439 2.007535 2.095066
elementType: Cl O N C H
totalener: -1744.46497238 hartree
nucrepener: 1848.33202911 hartree
electener: -3592.79700150 hartree
oneelecener: -6064.30936007 hartree
twoeener: 2471.51235857 hartree
cpcmener: -0.02041598 hartree
kineticenergy: 1739.54102168 hartree
xcener: -122.436405941297 hartree
chargesum: -0.0000000
charge: -0.093107 -0.095030 -0.330521 -0.500835 -0.133121 0.131637 0.361615 0.350527 -0.252774 0.032608 -0.106212 -0.210395 0.227172 0.014180 -0.171951 -0.221188 -0.227813 -0.237025 -0.129653 -0.134591 -0.196093 0.099255 0.104305 0.107791 0.098580 0.162641 0.142703 0.142622 0.108383 0.109049 0.088206 0.125695 0.156863 0.159195 0.158520 0.158762
qa: -0.0931 -0.0950 -0.3305 -0.5008 -0.1331 0.1316 0.3616 0.3505 -0.2528 0.0326 -0.1062 -0.2104 0.2272 0.0142 -0.1720 -0.2212 -0.2278 -0.2370 -0.1297 -0.1346 -0.1961 0.0993 0.1043 0.1078 0.0986 0.1626 0.1427 0.1426 0.1084 0.1090 0.0882 0.1257 0.1569 0.1592 0.1585 0.1588
va: 1.2464 1.2319 2.0631 2.0193 3.2605 3.8751 3.7259 4.1595 3.8994 3.6547 3.9259 3.9615 3.7214 3.8579 4.0581 3.9169 3.9612 3.9480 3.9282 3.9132 3.9209 1.0192 1.0073 1.0195 1.0044 1.0504 1.0037 1.0074 0.9987 0.9985 1.0238 1.0126 1.0394 0.9903 0.9914 0.9903
dispcorr: -0.016865444 hartree
energy: -1744.481837826845
dipole: 20.51734 -21.30017 -0.78283 -4.00700 3.79141 -0.21559 -0.45568 0.97656 0.52088
magnitude: 0.96469 au
magnitude: 2.45204 debye
