program: Orca
programVersion: 4.2.1
elementType: Cl Cl O O N C C C C C C C C C C C C C C C C H H H H H H H H H H H H H H H
charge: 0
multiplicity: 1
keywords: wb97x-d3
keywords: def2-TZVPP
keywords: def2/J RIJCOSX GRIDX6 NOFINALGRIDX
keywords: grid4 nofinalgrid
keywords: scfconv7
keywords: smallprint printgap noloewdin
keywords: NOSOSCF
formula: C16H15Cl2NO2
InChI: InChI=1/C16H15Cl2NO2/c1-10-13(17)8-9-14(15(10)18)21-11(2)16(20)19-12-6-4-3-5-7-12/h3-9,11,19H,1-2H3
36 atoms
Cl -1.20544 1.716556 -0.995373
Cl -5.8204 -0.759488 0.412158
O  0.02718 -0.634173 0.213907
O  2.820887 -0.749462 -1.938377
N  2.517713 0.01346 0.189343
C  0.676804 -1.060036 -0.983944
C  -1.329027 -0.664714 0.22474
C  2.120237 -0.568758 -0.957994
C  0.644988 -2.570641 -1.137218
C  -3.465863 0.410868 -0.290467
C  -2.069096 0.384606 -0.312329
C  -1.994602 -1.724214 0.818994
C  3.780651 0.49826 0.547583
C  -4.090634 -0.68077 0.314396
C  -3.375199 -1.73122 0.867977
C  -4.208788 1.565871 -0.884271
C  3.903196 1.011496 1.841224
C  4.896489 0.491893 -0.289932
C  5.114047 1.505947 2.292102
C  6.105047 0.991396 0.177985
C  6.227388 1.499021 1.462074
H  0.203498 -0.596712 -1.856328
H  1.138514 -3.067266 -0.300901
H  1.146863 -2.862523 -2.058243
H  -0.380939 -2.933217 -1.202316
H  1.807598 0.10439 0.902015
H  -1.429258 -2.536928 1.255586
H  -3.892702 -2.557707 1.334651
H  -3.980559 2.491781 -0.35418
H  -5.284732 1.424272 -0.846865
H  -3.93286 1.714042 -1.92872
H  3.042442 1.020253 2.500171
H  4.837429 0.105928 -1.294265
H  5.18543 1.896853 3.298828
H  6.963076 0.97956 -0.481948
H  7.175721 1.884128 1.812673
elementType: Cl O N C H
totalener: -1744.46362960 hartree
nucrepener: 1847.83947766 hartree
electener: -3592.30310726 hartree
oneelecener: -6063.58849872 hartree
twoeener: 2471.28539146 hartree
cpcmener: -0.02152662 hartree
kineticenergy: 1739.53768572 hartree
xcener: -122.431608642580 hartree
chargesum: -0.0000000
charge: -0.075008 -0.088968 -0.376266 -0.505611 -0.115589 0.132582 0.243757 0.355813 -0.282563 0.010014 -0.037570 -0.219610 0.218362 0.046357 -0.111397 -0.212366 -0.239505 -0.246306 -0.115450 -0.133688 -0.199786 0.096886 0.103296 0.108902 0.102459 0.168612 0.159898 0.142084 0.109821 0.085694 0.107595 0.134238 0.158187 0.158988 0.157444 0.158697
qa: -0.0750 -0.0890 -0.3763 -0.5056 -0.1156 0.1326 0.2438 0.3558 -0.2826 0.0100 -0.0376 -0.2196 0.2184 0.0464 -0.1114 -0.2124 -0.2395 -0.2463 -0.1155 -0.1337 -0.1998 0.0969 0.1033 0.1089 0.1025 0.1686 0.1599 0.1421 0.1098 0.0857 0.1076 0.1342 0.1582 0.1590 0.1574 0.1587
va: 1.2683 1.2347 1.9562 2.0151 3.2489 3.8635 3.7926 4.1107 3.9142 3.6669 3.9815 4.0016 3.7546 3.8300 3.9850 3.9120 3.9596 3.9509 3.8935 3.9109 3.9206 1.0189 1.0060 1.0233 1.0026 1.0378 0.9927 1.0047 0.9979 1.0244 0.9997 1.0108 1.0396 0.9899 0.9921 0.9906
dispcorr: -0.016963930 hartree
energy: -1744.480593530657
dipole: 21.31321 -22.22047 -0.90726 -4.10354 3.79260 -0.31094 1.50775 -0.24844 1.25931
magnitude: 1.58293 au
magnitude: 4.02349 debye
