program: Orca
programVersion: 4.2.1
elementType: Cl Cl O O N C C C C C C C H H H H H
charge: 0
multiplicity: 1
keywords: wb97x-d3
keywords: def2-TZVPP
keywords: def2/J RIJCOSX GRIDX6 NOFINALGRIDX
keywords: grid4 nofinalgrid
keywords: scfconv7
keywords: smallprint printgap noloewdin
keywords: NOSOSCF
formula: C7H5Cl2NO2
InChI: InChI=1/C7H5Cl2NO2/c8-3-1-4(7(11)12)6(9)5(10)2-3/h1-2,11H,10H2
17 atoms
Cl -2.472761 1.159894 -0.064275
Cl 3.534186 -0.423361 -0.000271
O  -2.55662 -1.612587 0.519419
O  -1.043698 -2.936666 -0.427553
N  -0.206916 3.00069 0.070833
C  -0.439467 -0.683762 -0.00853
C  0.145102 1.678978 0.021787
C  -0.819702 0.657173 0.007419
C  0.911873 -1.017823 -0.02554
C  1.49275 1.316144 0.030321
C  1.858291 -0.013645 0.002379
C  -1.366089 -1.855798 -0.014885
H  1.206421 -2.056045 -0.056129
H  2.25314 2.086015 0.054912
H  0.49152 3.664893 -0.210533
H  -1.141942 3.244494 -0.204225
H  -3.07191 -2.429623 0.480583
totalener: -1395.44777566 hartree
nucrepener: 861.54603750 hartree
electener: -2256.99381315 hartree
oneelecener: -3629.81119944 hartree
twoeener: 1372.81738628 hartree
kineticenergy: 1392.25711279 hartree
xcener: -86.491298011218 hartree
chargesum: 0.0000000
charge: -0.072356 -0.067399 -0.253560 -0.343323 -0.253836 -0.006317 0.164555 -0.054676 -0.152519 -0.154943 0.103824 0.382708 0.126474 0.095318 0.137223 0.143124 0.205701
qa: -0.0724 -0.0674 -0.2536 -0.3433 -0.2538 -0.0063 0.1646 -0.0547 -0.1525 -0.1549 0.1038 0.3827 0.1265 0.0953 0.1372 0.1431 0.2057
va: 1.2665 1.2370 2.1967 2.1445 3.1741 3.6963 3.9034 4.0408 4.0386 4.0530 4.0127 4.2443 1.0314 1.0287 1.0328 1.0563 1.0437
dispcorr: -0.006509538 hartree
energy: -1395.454285193305
dipole: -1.70851 1.30358 -0.40492 3.18286 -1.95689 1.22597 0.14509 -0.16408 -0.01899
magnitude: 1.29125 au
magnitude: 3.28209 debye
