program: Orca
programVersion: 4.2.1
elementType: Cl S O O O N C C C C C C C C C C C H H H H H H H H H H
charge: 0
multiplicity: 1
keywords: wb97x-d3
keywords: def2-TZVPP
keywords: def2/J RIJCOSX GRIDX6 NOFINALGRIDX
keywords: grid4 nofinalgrid
keywords: scfconv7
keywords: smallprint printgap noloewdin
keywords: NOSOSCF
formula: C11H10ClNO3S
InChI: InChI=1/C11H10ClNO3S/c1-2-16-9(14)6-13-10-7(12)4-3-5-8(10)17-11(13)15/h3-5H,2,6H2,1H3
27 atoms
Cl 1.038017 -1.815324 -1.546667
S  -2.54381 1.245167 0.965978
O  1.88084 0.651162 0.545878
O  -1.01678 3.086378 -0.145006
O  3.027314 1.1389 -1.31774
N  -0.494116 0.885279 -0.567833
C  -0.903761 -0.392676 -0.218036
C  0.649347 1.241472 -1.375426
C  -2.033629 -0.377963 0.6113
C  -1.222144 1.914241 -0.003245
C  -0.371375 -1.633528 -0.560635
C  -2.633273 -1.532142 1.075622
C  1.996276 0.99961 -0.724434
C  -0.970331 -2.797777 -0.098942
C  -2.09293 -2.752801 0.709507
C  3.086936 0.370644 1.264363
C  2.700518 -0.022711 2.669184
H  0.626104 0.735993 -2.338383
H  0.573991 2.309211 -1.584963
H  -3.505253 -1.478074 1.712859
H  -0.541477 -3.749034 -0.38086
H  -2.542412 -3.672901 1.05538
H  3.630201 -0.433108 0.763221
H  3.729933 1.252966 1.262037
H  2.074613 -0.914382 2.676017
H  3.598755 -0.238687 3.246818
H  2.162412 0.778198 3.174431
totalener: -1564.13478798 hartree
nucrepener: 1509.84146282 hartree
electener: -3073.97625080 hartree
oneelecener: -5148.00695011 hartree
twoeener: 2074.03069931 hartree
kineticenergy: 1559.97413256 hartree
xcener: -106.749649709831 hartree
chargesum: -0.0000000
charge: -0.058177 0.046308 -0.256049 -0.354217 -0.342838 -0.019057 0.166059 -0.163617 -0.052061 0.230900 -0.085516 -0.089391 0.354498 -0.104603 -0.149218 0.017265 -0.232579 0.145360 0.130234 0.119576 0.120125 0.130947 0.093907 0.097207 0.084245 0.082852 0.087841
qa: -0.0582 0.0463 -0.2560 -0.3542 -0.3428 -0.0191 0.1661 -0.1636 -0.0521 0.2309 -0.0855 -0.0894 0.3545 -0.1046 -0.1492 0.0173 -0.2326 0.1454 0.1302 0.1196 0.1201 0.1309 0.0939 0.0972 0.0842 0.0829 0.0878
va: 1.2663 2.5528 2.1120 2.1550 2.1724 3.1375 3.6971 3.8226 3.9617 4.3381 3.9726 3.9246 4.1511 3.9844 3.9905 3.8676 3.9572 1.0022 1.0366 1.0066 1.0103 0.9988 1.0004 0.9995 1.0034 1.0093 1.0048
dispcorr: -0.013662589 hartree
energy: -1564.148450569747
dipole: 7.96795 -8.40329 -0.43533 -2.61769 1.07988 -1.53781 10.92420 -10.08621 0.83800
magnitude: 1.80461 au
magnitude: 4.58695 debye
