program: Orca
programVersion: 4.2.1
elementType: Cl Cl O O N N C C C C C C H H H H
charge: 0
multiplicity: 1
keywords: wb97x-d3
keywords: def2-TZVPP
keywords: def2/J RIJCOSX GRIDX6 NOFINALGRIDX
keywords: grid4 nofinalgrid
keywords: scfconv7
keywords: smallprint printgap noloewdin
keywords: NOSOSCF
formula: C6H4Cl2N2O2
InChI: InChI=1/C6H4Cl2N2O2/c7-3-1-2(9)4(8)5(10-3)6(11)12/h1,11H,9H2
16 atoms
Cl -2.539887 -1.002841 -0.099563
Cl 3.460865 0.283683 0.077906
O  -0.65655 2.932741 -0.419999
O  -2.374516 1.84012 0.490536
N  0.945392 0.91537 0.026685
N  -0.389259 -3.003919 -0.115082
C  0.042096 -1.726952 -0.043454
C  -0.858687 -0.640157 -0.028919
C  -0.356812 0.651328 0.003317
C  1.402167 -1.421355 -0.001578
C  1.774912 -0.092029 0.030151
C  -1.256802 1.8509 0.05714
H  2.145882 -2.206409 -0.004316
H  -1.364027 -3.212719 -0.001265
H  0.259403 -3.755568 0.02285
H  -1.268298 3.675083 -0.329642
totalener: -1411.49011389 hartree
nucrepener: 870.51562726 hartree
electener: -2282.00574115 hartree
oneelecener: -3670.13025996 hartree
twoeener: 1388.12451881 hartree
kineticenergy: 1408.31149277 hartree
xcener: -87.380953030902 hartree
chargesum: 0.0000000
charge: -0.050459 -0.064016 -0.227450 -0.327408 -0.255606 -0.237723 0.159675 -0.073175 0.168821 -0.187807 0.165762 0.327960 0.096329 0.153826 0.147490 0.203782
qa: -0.0505 -0.0640 -0.2274 -0.3274 -0.2556 -0.2377 0.1597 -0.0732 0.1688 -0.1878 0.1658 0.3280 0.0963 0.1538 0.1475 0.2038
va: 1.2871 1.2340 2.2384 2.1424 3.0573 3.2348 3.9891 4.0448 3.7619 4.0164 4.2551 4.3345 1.0278 1.0539 1.0297 1.0423
dispcorr: -0.005857885 hartree
energy: -1411.495971779738
dipole: -1.49460 1.48604 -0.00856 -4.13265 2.63899 -1.49366 -0.25812 0.13588 -0.12224
magnitude: 1.49868 au
magnitude: 3.80934 debye
