program: Orca
programVersion: 4.2.1
elementType: Cl Cl Cl O O O C C C C C C C C H H H H H
charge: 0
multiplicity: 1
keywords: wb97x-d3
keywords: def2-TZVPP
keywords: def2/J RIJCOSX GRIDX6 NOFINALGRIDX
keywords: grid4 nofinalgrid
keywords: scfconv7
keywords: smallprint printgap noloewdin
keywords: NOSOSCF
formula: C8H5Cl3O3
InChI: InChI=1/C8H5Cl3O3/c9-4-1-6(11)7(2-5(4)10)14-3-8(12)13/h1-2,12H,3H2
19 atoms
Cl 0.869761 2.785153 0.405025
Cl -2.568243 -2.294578 -0.488003
Cl -3.951982 0.53175 -0.265356
O  1.864799 0.120902 0.170131
O  4.681207 -1.978035 0.157706
O  4.497109 0.241443 0.391752
C  0.533347 0.13406 0.061011
C  -0.092981 1.381234 0.157411
C  -0.254388 -0.991305 -0.138635
C  -1.633864 -0.873274 -0.239763
C  -1.463166 1.49625 0.057159
C  -2.244405 0.366581 -0.142743
C  2.53127 -1.111828 0.080966
C  4.005448 -0.841153 0.230177
H  0.185515 -1.975654 -0.218852
H  -1.930646 2.468428 0.13456
H  2.215899 -1.804544 0.869693
H  2.356895 -1.601446 -0.88412
H  5.631502 -1.811077 0.253843
elementType: Cl O C H
totalener: -1914.24229990 hartree
nucrepener: 1166.23280102 hartree
electener: -3080.47510092 hartree
oneelecener: -4953.42613238 hartree
twoeener: 1872.95103147 hartree
cpcmener: -0.02537287 hartree
kineticenergy: 1910.12080663 hartree
xcener: -112.501732733129 hartree
chargesum: 0.0000000
charge: -0.067937 -0.059054 -0.068076 -0.275128 -0.295800 -0.408402 0.313405 -0.071654 -0.143039 0.002671 -0.068898 -0.011521 0.023152 0.352297 0.119341 0.124857 0.136770 0.135796 0.261220
qa: -0.0679 -0.0591 -0.0681 -0.2751 -0.2958 -0.4084 0.3134 -0.0717 -0.1430 0.0027 -0.0689 -0.0115 0.0232 0.3523 0.1193 0.1249 0.1368 0.1358 0.2612
va: 1.2466 1.2610 1.2469 2.1255 2.1865 2.0953 3.8991 3.9584 3.8972 4.0450 4.0051 3.9647 3.7965 4.3102 1.0341 1.0185 0.9907 0.9909 0.9909
dispcorr: -0.007778294 hartree
energy: -1914.250078192912
dipole: 15.67953 -14.79963 0.87990 -5.82927 4.18157 -1.64770 0.62342 -0.73828 -0.11487
magnitude: 1.87146 au
magnitude: 4.75686 debye
