program: Orca
programVersion: 4.2.1
elementType: Cl Cl Cl O O O C C C C C C C C H H H H H
charge: 0
multiplicity: 1
keywords: wb97x-d3
keywords: def2-TZVPP
keywords: def2/J RIJCOSX GRIDX6 NOFINALGRIDX
keywords: grid4 nofinalgrid
keywords: scfconv7
keywords: smallprint printgap noloewdin
keywords: NOSOSCF
formula: C8H5Cl3O3
InChI: InChI=1/C8H5Cl3O3/c9-4-1-6(11)7(2-5(4)10)14-3-8(12)13/h1-2,12H,3H2
19 atoms
Cl 0.683025 3.173343 0.082953
Cl -1.941694 -2.418764 -0.416487
Cl -3.701866 0.092534 0.318912
O  2.043706 0.755805 -0.568067
O  3.966117 -2.144541 0.182977
O  2.728133 -0.845776 1.524178
C  0.740375 0.517794 -0.369822
C  -0.053429 1.623371 -0.051509
C  0.132073 -0.72477 -0.481584
C  -1.232763 -0.859119 -0.272209
C  -1.410237 1.488955 0.157236
C  -2.009892 0.242993 0.049485
C  2.916142 -0.313998 -0.812769
C  3.172696 -1.11895 0.442222
H  0.697785 -1.610263 -0.7361
H  -2.00647 2.355826 0.406647
H  2.576493 -0.960616 -1.628323
H  3.85806 0.130895 -1.140141
H  4.15144 -2.643215 0.994108
elementType: Cl O C H
totalener: -1914.24296195 hartree
nucrepener: 1194.72969997 hartree
electener: -3108.97266192 hartree
oneelecener: -5010.77655670 hartree
twoeener: 1901.80389478 hartree
cpcmener: -0.02422368 hartree
kineticenergy: 1910.11728820 hartree
xcener: -112.502275036564 hartree
chargesum: -0.0000000
charge: -0.072378 -0.058830 -0.068189 -0.293020 -0.296682 -0.406586 0.284751 -0.063509 -0.115592 0.016288 -0.072250 -0.011546 0.004318 0.361852 0.113182 0.124142 0.133950 0.154311 0.265788
qa: -0.0724 -0.0588 -0.0682 -0.2930 -0.2967 -0.4066 0.2848 -0.0635 -0.1156 0.0163 -0.0723 -0.0115 0.0043 0.3619 0.1132 0.1241 0.1339 0.1543 0.2658
va: 1.2403 1.2612 1.2462 2.1138 2.1928 2.0861 3.8920 3.9647 3.8870 4.0211 4.0270 3.9634 3.8514 4.2104 1.0327 1.0184 0.9970 0.9969 0.9875
dispcorr: -0.008534933 hartree
energy: -1914.251496880676
dipole: 15.49003 -13.88784 1.60219 -3.73385 2.75565 -0.97820 -1.93589 1.03389 -0.90200
magnitude: 2.08266 au
magnitude: 5.29371 debye
