program: Gaussian 09
title: 000059274
version: EM64L-G09RevD.01
frameworkgroup: C1[X(C16H15NO2)]
method: RPBEPBE
basis: SDD
operation: Freq
keyword: #p
keyword: freq=noraman
keyword: PBEPBE/SDD
title: #p freq=noraman PBEPBE/SDD
converged: YES YES NO NO
title: Mulliken charges:
elementType: O O N C C C C C C C C C C C C C C C C H H H H H H H H H H H H H H H
charge: -0.318845 -0.275279 -0.157875 0.195629 0.235254 0.370368 0.426690 0.397013 -0.589936 -0.592215 0.124775 -0.363393 -0.465105 -0.418460 -0.417492 -0.647647 -0.660503 -0.244120 -0.236770 0.287907 0.260123 0.221409 0.239037 0.249668 0.249822 0.241297 0.228276 0.233845 0.277732 0.250566 0.215605 0.223402 0.230434 0.228789
chargesum: 0.00000
title: Mulliken charges with hydrogens summed into heavy atoms:
elementType: O O N C C C C C C C C C C C C C C C C
charge: -0.318845 -0.275279 -0.157875 0.195629 0.235254 0.370368 0.426690 0.397013 -0.302029 -0.332092 0.124775 0.097053 -0.215437 -0.168639 -0.176195 0.092205 0.029071 -0.013685 -0.007981
polarizability: 3.39554698e+02 -4.23879271e+00 2.01757439e+02 -5.56174868e+00 -5.04854983e-01 8.77369522e+01
1716.lowfreq: -9.8072 -6.0638 0.0005 0.0005 0.0010 6.6628 35.2914 64.2749 71.8870
frequency: 35.2176 64.2571 71.8795 78.3514 94.3986 124.6636 143.6914 163.0839 185.4943 206.3289 235.0623 240.5453 296.9818 315.0074 317.4969 374.5843 412.5592 423.4055 463.8679 481.2055 494.2971 512.8901 535.4706 547.3369 605.2222 622.3901 629.1394 638.8611 674.6137 738.4850 745.4317 760.8232 780.5786 788.5920 793.4722 812.3464 847.2338 857.3157 893.9789 898.8615 939.5921 945.1839 972.9324 992.9963 996.5294 1020.2921 1040.7577 1070.4399 1085.3703 1120.2738 1136.6557 1143.5875 1156.8824 1173.0612 1209.9571 1217.5968 1247.1704 1264.7880 1267.2172 1280.5507 1324.9782 1346.8112 1355.1259 1387.8058 1394.1541 1412.5896 1422.1377 1433.6874 1444.1691 1454.3053 1469.2263 1477.5156 1483.2880 1484.8635 1492.4035 1507.3122 1556.8425 1579.4204 1611.5155 1622.7762 1645.5547 2969.3689 2990.1430 3003.6819 3038.3738 3056.0792 3087.4775 3098.2539 3122.4757 3129.8521 3140.6016 3145.1235 3146.4381 3152.6383 3163.7247 3197.4500
redmass: 3.4508 3.5370 2.1992 1.5543 5.5013 3.0513 3.4706 4.9199 3.1849 1.2727 3.8210 4.5293 3.5213 5.3005 6.0315 3.4144 3.6079 4.0240 3.2949 2.5886 5.9864 7.6924 3.9524 4.7683 5.9106 3.9693 5.8328 6.4367 5.7010 2.6273 5.7197 1.2664 2.5829 2.4511 1.4496 2.0057 4.1384 1.3606 4.0509 1.6920 3.1149 1.4804 1.4404 1.3458 2.7973 2.3078 4.4448 1.8912 1.5736 1.3274 1.6379 1.7150 1.8431 1.0765 3.1175 1.3545 2.5850 1.6374 1.8560 2.3491 2.2030 1.3555 2.8610 1.5028 1.9202 6.2228 3.3258 1.4887 2.6673 3.0677 1.0487 1.0767 1.1001 1.0643 1.0904 4.0225 7.6169 7.6685 6.3482 6.4422 7.6056 1.0385 1.0356 1.0606 1.1017 1.1031 1.0997 1.1016 1.0859 1.0886 1.0917 1.0953 1.0948 1.0923 1.1005 1.0908
irintensity: 1.3641 1.3016 0.8263 0.4952 0.2288 0.2834 2.1707 0.8564 2.8423 1.2453 1.7054 0.3708 2.2524 1.8715 2.9264 3.5253 0.2886 2.5702 0.4576 23.1591 17.2475 1.5119 0.4098 1.3900 7.6386 1.0150 1.2306 2.2668 10.5366 6.2053 6.7162 46.0162 4.2412 16.9319 2.3593 50.8370 8.4581 16.8240 1.0301 32.7564 16.6934 6.0530 17.5801 0.1812 23.5559 6.4507 27.3762 18.6625 112.2243 3.6788 9.5075 1.6030 97.6508 2.0003 15.3828 21.0119 177.1805 25.3518 0.2557 3.6892 47.6916 119.4589 262.2276 64.5291 66.6611 1.7433 5.6173 6.1768 33.4877 19.6693 13.4323 5.8306 14.0788 9.9707 18.0523 11.8344 132.1057 38.7372 204.4196 731.9662 33.4378 95.6685 25.8803 55.2928 32.2945 4.9956 38.2790 38.5009 2.0154 0.2472 1.6796 27.0652 2.9967 5.4585 39.7992 8.4197
temp: 298.150 k
press: 1.00000 atm
elementType: 8 8 7 6 6 6 6 6 6 6 6 6 6 6 6 6 6 6 6 1 1 1 1 1 1 1 1 1 1 1 1 1 1 1
symmnumber: 1
zpe: 708999.3 jmol-1
zpe.correction: 0.270044 hartree
zpe.thermalcorrener: 0.286630 hartree
zpe.thermalcorrenthalpy: 0.287575 hartree
zpe.thermalcorrgfe: 0.225568 hartree
zpe.sumelectzpe: -822.566067 hartree
zpe.sumelectthermal: -822.549480 hartree
zpe.sumelectthermalent: -822.548536 hartree
zpe.sumelectthermalfe: -822.610543 hartree
dipole: 2.7168 -5.5795 0.1438
dipole: 6.2074
quadrupole: -75.0678 -117.0940 -116.0415
quadrupole: -6.9457 -1.1309 0.5526
quadrupole: 27.6666 -14.3596 -13.3071 -6.9457 -1.1309 0.5526
hfenergy: -822.8361108 hartree
pointgroup: C01 [X(C16H15N1O2)]
dipole: 1.0422325 2.2072999 -0.0768935 debye
polarizability: 339.3466142|6.0163879|201.8549367|7.139195|-1.8000466|87.8475384 unknown
InChI: InChI=1S/C16H15NO2/c1-3-17(2)16-10-14(18)13-8-11-6-4-5-7-12(11)9-15(13)19-16/h4-10H,3H2,1-2H3
charge 0 multiplicity 1
34 atoms
O  1.277388 1.044842 0.134491
O  0.847075 -3.128446 0.19284
N  3.570005 0.919176 0.284019
C  -0.203248 -0.944038 0.105049
C  -0.021673 0.475602 0.077939
C  -2.638428 -0.577137 -0.023298
C  -2.423647 0.861216 -0.0502
C  2.395556 0.202468 0.208815
C  -1.508778 -1.445295 0.053405
C  -1.087506 1.367501 0.001786
C  0.984327 -1.855403 0.177929
C  4.863257 0.210274 0.405704
C  2.269659 -1.186683 0.216338
C  -3.982496 -1.080397 -0.075035
C  -3.562565 1.731485 -0.127524
C  3.627776 2.38514 0.146885
C  5.443566 -0.245956 -0.952249
C  -5.069376 -0.208786 -0.150006
C  -4.855886 1.208698 -0.176403
H  -1.631096 -2.534515 0.073129
H  -0.899076 2.4456 -0.01543
H  5.566671 0.904397 0.901569
H  4.73731 -0.65328 1.083366
H  3.15552 -1.822153 0.243016
H  -4.139285 -2.165111 -0.054309
H  -3.402368 2.815947 -0.14754
H  4.287057 2.666496 -0.6968
H  4.026621 2.843676 1.072185
H  2.623953 2.787131 -0.040575
H  4.764931 -0.954988 -1.456484
H  5.603576 0.615561 -1.62501
H  6.416814 -0.747067 -0.801337
H  -6.090924 -0.601925 -0.189116
H  -5.718111 1.882169 -0.235349
