program: Orca
programVersion: 4.2.1
elementType: Cl Cl O O O C C C C C C C C C C H H H H H H H H H H
charge: 0
multiplicity: 1
keywords: wb97x-d3
keywords: def2-TZVPP
keywords: def2/J RIJCOSX GRIDX6 NOFINALGRIDX
keywords: grid4 nofinalgrid
keywords: scfconv7
keywords: smallprint printgap noloewdin
keywords: NOSOSCF
formula: C10H10Cl2O3
InChI: InChI=1/C10H10Cl2O3/c11-7-3-4-9(8(12)6-7)15-5-1-2-10(13)14/h3-4,6,13H,1-2,5H2
25 atoms
Cl -0.994791 1.029785 -3.165496
Cl -4.415612 -0.449118 0.706595
O  1.007293 0.751903 -1.154546
O  4.806187 -0.688841 2.804153
O  2.583625 -0.597292 2.657878
C  2.634278 -0.802225 -0.195458
C  2.161048 0.635796 -0.327677
C  3.890639 -0.908981 0.653191
C  -0.19955 0.449584 -0.655749
C  3.663109 -0.707342 2.123852
C  -1.284517 0.550599 -1.533274
C  -0.456471 0.061376 0.656607
C  -2.576981 0.279409 -1.125783
C  -1.748941 -0.21327 1.077863
C  -2.800503 -0.103414 0.187324
H  2.860414 -1.185271 -1.192032
H  1.852695 -1.444408 0.214715
H  2.92536 1.226504 -0.833129
H  1.984617 1.106562 0.643091
H  4.656066 -0.20481 0.315281
H  4.334751 -1.90082 0.530727
H  0.344472 -0.043387 1.375155
H  -3.395135 0.368266 -1.826794
H  -1.919463 -0.513744 2.102024
H  4.626602 -0.578805 3.750656
elementType: Cl O C H
totalener: -1533.27190419 hartree
nucrepener: 1160.49722502 hartree
electener: -2693.76912921 hartree
oneelecener: -4412.39513174 hartree
twoeener: 1718.62600254 hartree
cpcmener: -0.02605991 hartree
kineticenergy: 1529.33943165 hartree
xcener: -100.034338304535 hartree
chargesum: 0.0000000
charge: -0.087393 -0.099699 -0.323492 -0.313188 -0.465470 -0.134729 0.001863 -0.137527 0.308756 0.412634 -0.057660 -0.204320 -0.098910 -0.196308 0.063915 0.093147 0.091560 0.120460 0.105600 0.103555 0.124184 0.158736 0.124266 0.145473 0.264547
qa: -0.0874 -0.0997 -0.3235 -0.3132 -0.4655 -0.1347 0.0019 -0.1375 0.3088 0.4126 -0.0577 -0.2043 -0.0989 -0.1963 0.0639 0.0931 0.0916 0.1205 0.1056 0.1036 0.1242 0.1587 0.1243 0.1455 0.2645
va: 1.2277 1.2030 2.0924 2.1795 1.9976 3.8345 3.8394 3.8645 3.8292 4.1697 3.9318 3.8442 4.0122 4.0610 3.8514 1.0208 1.0206 1.0012 1.0036 1.0179 1.0105 1.0135 1.0192 1.0069 0.9873
dispcorr: -0.010998744 hartree
energy: -1533.282902933870
dipole: 24.51694 -22.10160 2.41534 -3.75401 3.39412 -0.35990 8.20548 -7.41801 0.78747
magnitude: 2.56584 au
magnitude: 6.52184 debye
