program: Orca
programVersion: 4.2.1
elementType: Cl Cl O O O C C C C C C C C C C H H H H H H H H H H
charge: 0
multiplicity: 1
keywords: wb97x-d3
keywords: def2-TZVPP
keywords: def2/J RIJCOSX GRIDX6 NOFINALGRIDX
keywords: grid4 nofinalgrid
keywords: scfconv7
keywords: smallprint printgap noloewdin
keywords: NOSOSCF
formula: C10H10Cl2O3
InChI: InChI=1/C10H10Cl2O3/c11-7-3-4-9(8(12)6-7)15-5-1-2-10(13)14/h3-4,6,13H,1-2,5H2
25 atoms
Cl -1.078672 -0.437105 2.550189
Cl -3.977644 1.234578 -1.655916
O  0.567801 -1.697899 0.589753
O  3.381772 1.943001 -0.49356
O  5.118517 1.127007 0.642762
C  2.563949 -0.870977 -0.56417
C  1.71152 -2.064282 -0.176652
C  3.036157 -0.080361 0.658469
C  -0.435676 -1.028226 0.00135
C  3.965926 1.037585 0.288323
C  -1.339961 -0.377648 0.845628
C  -0.652904 -0.953342 -1.371239
C  -2.430709 0.311633 0.349005
C  -1.739142 -0.260829 -1.883798
C  -2.621018 0.366176 -1.022498
H  2.028044 -0.219917 -1.257266
H  3.425136 -1.262022 -1.110853
H  2.274149 -2.734193 0.472934
H  1.426482 -2.642066 -1.059949
H  3.55568 -0.738613 1.354779
H  2.179402 0.34655 1.187004
H  0.016504 -1.439185 -2.067203
H  -3.114625 0.804277 1.026103
H  -1.885224 -0.218179 -2.954032
H  4.013449 2.642275 -0.721638
elementType: Cl O C H
totalener: -1533.27051347 hartree
nucrepener: 1173.12386018 hartree
electener: -2706.39437365 hartree
oneelecener: -4437.01463096 hartree
twoeener: 1730.62025731 hartree
cpcmener: -0.03030008 hartree
kineticenergy: 1529.34204570 hartree
xcener: -100.033262033921 hartree
chargesum: 0.0000000
charge: -0.086873 -0.098132 -0.332528 -0.303200 -0.474832 -0.169206 0.002090 -0.069524 0.297698 0.390573 -0.046794 -0.224668 -0.084578 -0.151948 0.044754 0.096691 0.106857 0.119508 0.117464 0.083338 0.095211 0.152693 0.126119 0.147975 0.261310
qa: -0.0869 -0.0981 -0.3325 -0.3032 -0.4748 -0.1692 0.0021 -0.0695 0.2977 0.3906 -0.0468 -0.2247 -0.0846 -0.1519 0.0448 0.0967 0.1069 0.1195 0.1175 0.0833 0.0952 0.1527 0.1261 0.1480 0.2613
va: 1.2274 1.2046 2.0665 2.1637 2.0087 3.8444 3.8810 3.7877 3.8227 4.2095 3.9199 3.9031 3.9970 3.9949 3.8630 1.0207 1.0173 0.9943 0.9951 1.0303 1.0314 0.9980 1.0177 1.0026 0.9900
dispcorr: -0.011210615 hartree
energy: -1533.281724083089
dipole: 19.85554 -19.56590 0.28964 -6.10950 5.54352 -0.56597 -6.10565 4.58299 -1.52266
magnitude: 1.65006 au
magnitude: 4.19412 debye
