program: Orca
programVersion: 4.2.1
elementType: Cl Cl O O O C C C C C C C C C C H H H H H H H H H H
charge: 0
multiplicity: 1
keywords: wb97x-d3
keywords: def2-TZVPP
keywords: def2/J RIJCOSX GRIDX6 NOFINALGRIDX
keywords: grid4 nofinalgrid
keywords: scfconv7
keywords: smallprint printgap noloewdin
keywords: NOSOSCF
formula: C10H10Cl2O3
InChI: InChI=1/C10H10Cl2O3/c11-7-3-4-9(8(12)6-7)15-5-1-2-10(13)14/h3-4,6,13H,1-2,5H2
25 atoms
Cl -0.435002 2.246103 -0.412242
Cl -5.120114 -0.383874 -0.598525
O  0.721537 -0.353091 -0.281723
O  4.935234 0.900207 2.283753
O  5.538934 -0.085333 0.375935
C  2.950284 -1.133205 -0.082879
C  1.495788 -1.539849 -0.149113
C  3.25592 -0.261867 1.124283
C  -0.610074 -0.441287 -0.342135
C  4.689381 0.172107 1.196097
C  -1.317587 0.763625 -0.419539
C  -1.335262 -1.628752 -0.337102
C  -2.696085 0.790565 -0.49915
C  -2.720885 -1.614925 -0.414503
C  -3.391667 -0.409294 -0.497107
H  3.225336 -0.622896 -1.008038
H  3.538979 -2.051611 -0.043651
H  1.201931 -2.083655 0.755224
H  1.329998 -2.198143 -1.007067
H  3.010452 -0.787988 2.051711
H  2.638271 0.640646 1.12465
H  -0.832794 -2.583999 -0.273994
H  -3.216801 1.736045 -0.560174
H  -3.262613 -2.550329 -0.409154
H  5.86443 1.176167 2.294728
elementType: Cl O C H
totalener: -1533.27421035 hartree
nucrepener: 1140.54238073 hartree
electener: -2673.81659109 hartree
oneelecener: -4372.08239607 hartree
twoeener: 1698.26580498 hartree
cpcmener: -0.02900575 hartree
kineticenergy: 1529.34782513 hartree
xcener: -100.033688796216 hartree
chargesum: -0.0000000
charge: -0.085165 -0.100464 -0.312278 -0.314773 -0.474826 -0.109041 -0.012900 -0.121930 0.333550 0.418362 -0.070932 -0.216820 -0.089165 -0.173329 0.049944 0.072941 0.082452 0.112076 0.122251 0.104061 0.100023 0.148809 0.126601 0.147406 0.263147
qa: -0.0852 -0.1005 -0.3123 -0.3148 -0.4748 -0.1090 -0.0129 -0.1219 0.3336 0.4184 -0.0709 -0.2168 -0.0892 -0.1733 0.0499 0.0729 0.0825 0.1121 0.1223 0.1041 0.1000 0.1488 0.1266 0.1474 0.2631
va: 1.2307 1.2021 2.0917 2.1755 2.0085 3.9444 3.8895 3.8092 3.8038 4.1963 3.9404 3.9235 3.9960 4.0292 3.8536 1.0247 1.0189 0.9875 0.9912 1.0173 1.0347 1.0041 1.0179 1.0031 0.9887
dispcorr: -0.010130189 hartree
energy: -1533.284340541652
dipole: 20.29470 -19.97006 0.32464 -11.25044 10.02864 -1.22180 4.13258 -3.26824 0.86434
magnitude: 1.53143 au
magnitude: 3.89258 debye
