program: Orca
programVersion: 4.2.1
elementType: Cl Cl O O O C C C C C C C C C C H H H H H H H H H H
charge: 0
multiplicity: 1
keywords: wb97x-d3
keywords: def2-TZVPP
keywords: def2/J RIJCOSX GRIDX6 NOFINALGRIDX
keywords: grid4 nofinalgrid
keywords: scfconv7
keywords: smallprint printgap noloewdin
keywords: NOSOSCF
formula: C10H10Cl2O3
InChI: InChI=1/C10H10Cl2O3/c11-7-3-4-9(8(12)6-7)15-5-1-2-10(13)14/h3-4,6,13H,1-2,5H2
25 atoms
Cl -0.548595 -0.613116 -2.995419
Cl -3.846942 0.021155 1.198122
O  1.331265 0.845125 -1.420661
O  1.405256 -1.434402 2.524611
O  2.82444 0.281956 2.403144
C  3.298416 -0.174287 -0.394621
C  2.556468 1.105581 -0.735224
C  2.563448 -1.165064 0.496215
C  0.182471 0.680658 -0.74612
C  2.290063 -0.672687 1.887666
C  -0.842918 -0.002689 -1.408916
C  -0.079608 1.158833 0.534457
C  -2.08015 -0.204179 -0.825606
C  -1.311502 0.954185 1.136244
C  -2.304809 0.276085 0.454429
H  4.24403 0.115832 0.068073
H  3.559296 -0.687202 -1.321865
H  3.156549 1.688867 -1.4325
H  2.404286 1.733413 0.142486
H  3.178383 -2.064715 0.602547
H  1.6356 -1.514465 0.039136
H  0.664685 1.712474 1.088174
H  -2.85201 -0.736575 -1.363926
H  -1.484426 1.335556 2.132745
H  1.279908 -1.111129 3.429753
elementType: Cl O C H
totalener: -1533.26892732 hartree
nucrepener: 1221.03169273 hartree
electener: -2754.30062005 hartree
oneelecener: -4533.19742669 hartree
twoeener: 1778.89680664 hartree
cpcmener: -0.02597570 hartree
kineticenergy: 1529.34526226 hartree
xcener: -100.036255696693 hartree
chargesum: -0.0000000
charge: -0.085387 -0.098009 -0.328764 -0.306351 -0.460936 -0.108330 -0.018140 -0.134415 0.230564 0.389574 -0.021543 -0.179880 -0.095565 -0.171825 0.068159 0.079093 0.087328 0.117739 0.111101 0.130096 0.103943 0.154076 0.124921 0.148301 0.264250
qa: -0.0854 -0.0980 -0.3288 -0.3064 -0.4609 -0.1083 -0.0181 -0.1344 0.2306 0.3896 -0.0215 -0.1799 -0.0956 -0.1718 0.0682 0.0791 0.0873 0.1177 0.1111 0.1301 0.1039 0.1541 0.1249 0.1483 0.2642
va: 1.2287 1.2042 2.0698 2.1813 2.0201 3.8792 3.8786 3.8240 3.8572 4.2183 3.8943 3.8279 4.0181 4.0261 3.8405 1.0264 1.0156 1.0022 1.0014 1.0091 1.0128 1.0064 1.0191 1.0040 0.9879
dispcorr: -0.013042163 hartree
energy: -1533.281969481706
dipole: 20.78264 -19.82066 0.96198 1.28507 -1.59054 -0.30546 5.62365 -5.01453 0.60912
magnitude: 1.17888 au
magnitude: 2.99647 debye
